{"text_format":"1","workbook":"xlsx","n_sheets":13,"sheets":["Notes","Entries","Draw","Chart","R1","Q-Final","Semi Final","Final","TEAMS","CARDS","CARDS 2","CARDS REAR","CARDS 2 REAR"],"not_rendered":{"charts":0,"images":2,"macros":1,"external_links":0,"defined_names":7,"comments":0,"pivot_tables":0},"unopened":[],"bounds":{"document_bytes":16777216,"sheet_cells":100000,"rows_first":2000,"rows_last":500,"rows_between":2000,"halvings":0,"cell_chars":16384,"cell_head_chars":4096},"cells_cut":0,"cells_raw":0,"read":"whole","date_system":"1900"}

{"sheet":"Notes","index":0,"n_rows":0,"n_cols":0,"rows_kept":0,"cut":false,"hidden":false,"merged":[]}

{"sheet":"Entries","index":1,"n_rows":22,"n_cols":14,"rows_kept":22,"cut":false,"hidden":false,"merged":[[19,13,22,18],[3,0,4,0],[2,6,2,11],[3,11,4,11],[3,6,4,6],[3,7,4,7],[3,8,4,8],[3,9,4,9],[3,10,4,10],[3,1,3,4],[15,13,17,18],[9,13,11,18],[12,13,13,18]]}
[]
[]
["No. Entries",{"$f":"COUNTA(E7:E22)","v":11},{"$f":"(B3-8)*2","v":6},null,null,null,"Draw results"]
["Entry No.","Enter Names in these column",null,null,null,null,"Draw No.","Team No.","Lead","Second","Third","Skip"]
[null,"Lead","Second","Third","Skip"]
[0,null,null,null,"Bye"]
[1,"A CONNOR",null,null,"B. CLAYTON",null,1,{"$f":"IF(G7<=$C$3,Draw!A3,HLOOKUP($B$3,Draw!$E$2:$BQ$139,Entries!G7+1,FALSE))","v":5},{"$f":"VLOOKUP($H7,$A$6:$E22,2,FALSE)","v":"A. MOORE"},{"$f":"VLOOKUP($H7,$A$6:$E22,3,FALSE)","v":0},{"$f":"VLOOKUP($H7,$A$6:$E22,4,FALSE)","v":0},{"$f":"VLOOKUP($H7,$A$6:$E22,5,FALSE)","v":"T. BUTT"}]
[2,"E. SHEPHERD",null,null,"A. McGHEE",null,2,{"$f":"IF(G8<=$C$3,Draw!A4,HLOOKUP($B$3,Draw!$E$2:$BQ$139,Entries!G8+1,FALSE))","v":4},{"$f":"VLOOKUP($H8,$A$6:$E22,2,FALSE)","v":"B. CROWLEY"},{"$f":"VLOOKUP($H8,$A$6:$E22,3,FALSE)","v":0},{"$f":"VLOOKUP($H8,$A$6:$E22,4,FALSE)","v":0},{"$f":"VLOOKUP($H8,$A$6:$E22,5,FALSE)","v":"E. HALL"}]
[3,"L. BOSHIER",null,null,"B. PORTER",null,3,{"$f":"IF(G9<=$C$3,Draw!A5,HLOOKUP($B$3,Draw!$E$2:$BQ$139,Entries!G9+1,FALSE))","v":11},{"$f":"VLOOKUP($H9,$A$6:$E22,2,FALSE)","v":"J. NEELY"},{"$f":"VLOOKUP($H9,$A$6:$E22,3,FALSE)","v":0},{"$f":"VLOOKUP($H9,$A$6:$E22,4,FALSE)","v":0},{"$f":"VLOOKUP($H9,$A$6:$E22,5,FALSE)","v":"G. FRASER"}]
[4,"B. CROWLEY",null,null,"E. HALL",null,4,{"$f":"IF(G10<=$C$3,Draw!A6,HLOOKUP($B$3,Draw!$E$2:$BQ$139,Entries!G10+1,FALSE))","v":9},{"$f":"VLOOKUP($H10,$A$6:$E22,2,FALSE)","v":"E. JONES"},{"$f":"VLOOKUP($H10,$A$6:$E22,3,FALSE)","v":0},{"$f":"VLOOKUP($H10,$A$6:$E22,4,FALSE)","v":0},{"$f":"VLOOKUP($H10,$A$6:$E22,5,FALSE)","v":"B. EDWARDS"},null,"      Enter the players names under the       \"Enter Names in this column\" heading"]
[5,"A. MOORE",null,null,"T. BUTT",null,5,{"$f":"IF(G11<=$C$3,Draw!A7,HLOOKUP($B$3,Draw!$E$2:$BQ$139,Entries!G11+1,FALSE))","v":3},{"$f":"VLOOKUP($H11,$A$6:$E23,2,FALSE)","v":"L. BOSHIER"},{"$f":"VLOOKUP($H11,$A$6:$E23,3,FALSE)","v":0},{"$f":"VLOOKUP($H11,$A$6:$E23,4,FALSE)","v":0},{"$f":"VLOOKUP($H11,$A$6:$E23,5,FALSE)","v":"B. PORTER"}]
[6,"D. COLEMAN",null,null,"E. BROWN",null,6,{"$f":"IF(G12<=$C$3,Draw!A8,HLOOKUP($B$3,Draw!$E$2:$BQ$139,Entries!G12+1,FALSE))","v":10},{"$f":"VLOOKUP($H12,$A$6:$E24,2,FALSE)","v":"J. HAYDEN"},{"$f":"VLOOKUP($H12,$A$6:$E24,3,FALSE)","v":0},{"$f":"VLOOKUP($H12,$A$6:$E24,4,FALSE)","v":0},{"$f":"VLOOKUP($H12,$A$6:$E24,5,FALSE)","v":"K.STAFFORD"}]
[7,"A. LAMB",null,null,"C. SPILKER",null,7,{"$f":"IF(G13<=$C$3,Draw!A9,HLOOKUP($B$3,Draw!$E$2:$BQ$139,Entries!G13+1,FALSE))","v":0},{"$f":"VLOOKUP($H13,$A$6:$E25,2,FALSE)","v":0},{"$f":"VLOOKUP($H13,$A$6:$E25,3,FALSE)","v":0},{"$f":"VLOOKUP($H13,$A$6:$E25,4,FALSE)","v":0},{"$f":"VLOOKUP($H13,$A$6:$E25,5,FALSE)","v":"Bye"},null,"Do NOT leave empty cells between the names"]
[8,"R. SOUTH",null,null,"N. BOYERS",null,8,{"$f":"IF(G14<=$C$3,Draw!A10,HLOOKUP($B$3,Draw!$E$2:$BQ$139,Entries!G14+1,FALSE))","v":6},{"$f":"VLOOKUP($H14,$A$6:$E26,2,FALSE)","v":"D. COLEMAN"},{"$f":"VLOOKUP($H14,$A$6:$E26,3,FALSE)","v":0},{"$f":"VLOOKUP($H14,$A$6:$E26,4,FALSE)","v":0},{"$f":"VLOOKUP($H14,$A$6:$E26,5,FALSE)","v":"E. BROWN"}]
[9,"E. JONES",null,null,"B. EDWARDS",null,9,{"$f":"IF(G15<=$C$3,Draw!A11,HLOOKUP($B$3,Draw!$E$2:$BQ$139,Entries!G15+1,FALSE))","v":0},{"$f":"VLOOKUP($H15,$A$6:$E27,2,FALSE)","v":0},{"$f":"VLOOKUP($H15,$A$6:$E27,3,FALSE)","v":0},{"$f":"VLOOKUP($H15,$A$6:$E27,4,FALSE)","v":0},{"$f":"VLOOKUP($H15,$A$6:$E27,5,FALSE)","v":"Bye"}]
[10,"J. HAYDEN",null,null,"K.STAFFORD",null,10,{"$f":"IF(G16<=$C$3,Draw!A12,HLOOKUP($B$3,Draw!$E$2:$BQ$139,Entries!G16+1,FALSE))","v":8},{"$f":"VLOOKUP($H16,$A$6:$E28,2,FALSE)","v":"R. SOUTH"},{"$f":"VLOOKUP($H16,$A$6:$E28,3,FALSE)","v":0},{"$f":"VLOOKUP($H16,$A$6:$E28,4,FALSE)","v":0},{"$f":"VLOOKUP($H16,$A$6:$E28,5,FALSE)","v":"N. BOYERS"},null,"If a cell turns RED after you have entered a name it indicates that name is entered twice"]
[11,"J. NEELY",null,null,"G. FRASER",null,11,{"$f":"IF(G17<=$C$3,Draw!A13,HLOOKUP($B$3,Draw!$E$2:$BQ$139,Entries!G17+1,FALSE))","v":0},{"$f":"VLOOKUP($H17,$A$6:$E29,2,FALSE)","v":0},{"$f":"VLOOKUP($H17,$A$6:$E29,3,FALSE)","v":0},{"$f":"VLOOKUP($H17,$A$6:$E29,4,FALSE)","v":0},{"$f":"VLOOKUP($H17,$A$6:$E29,5,FALSE)","v":"Bye"}]
[12,null,null,null,null,null,12,{"$f":"IF(G18<=$C$3,Draw!A14,HLOOKUP($B$3,Draw!$E$2:$BQ$139,Entries!G18+1,FALSE))","v":1},{"$f":"VLOOKUP($H18,$A$6:$E30,2,FALSE)","v":"A CONNOR"},{"$f":"VLOOKUP($H18,$A$6:$E30,3,FALSE)","v":0},{"$f":"VLOOKUP($H18,$A$6:$E30,4,FALSE)","v":0},{"$f":"VLOOKUP($H18,$A$6:$E30,5,FALSE)","v":"B. CLAYTON"}]
[13,null,null,null,null,null,13,{"$f":"IF(G19<=$C$3,Draw!A15,HLOOKUP($B$3,Draw!$E$2:$BQ$139,Entries!G19+1,FALSE))","v":0},{"$f":"VLOOKUP($H19,$A$6:$E31,2,FALSE)","v":0},{"$f":"VLOOKUP($H19,$A$6:$E31,3,FALSE)","v":0},{"$f":"VLOOKUP($H19,$A$6:$E31,4,FALSE)","v":0},{"$f":"VLOOKUP($H19,$A$6:$E31,5,FALSE)","v":"Bye"}]
[14,null,null,null,null,null,14,{"$f":"IF(G20<=$C$3,Draw!A16,HLOOKUP($B$3,Draw!$E$2:$BQ$139,Entries!G20+1,FALSE))","v":7},{"$f":"VLOOKUP($H20,$A$6:$E32,2,FALSE)","v":"A. LAMB"},{"$f":"VLOOKUP($H20,$A$6:$E32,3,FALSE)","v":0},{"$f":"VLOOKUP($H20,$A$6:$E32,4,FALSE)","v":0},{"$f":"VLOOKUP($H20,$A$6:$E32,5,FALSE)","v":"C. SPILKER"},null,"When you have entered all the players names click on the \"Draw\" tab to conduct the draw"]
[15,null,null,null,null,null,15,{"$f":"IF(G21<=$C$3,Draw!A17,HLOOKUP($B$3,Draw!$E$2:$BQ$139,Entries!G21+1,FALSE))","v":0},{"$f":"VLOOKUP($H21,$A$6:$E33,2,FALSE)","v":0},{"$f":"VLOOKUP($H21,$A$6:$E33,3,FALSE)","v":0},{"$f":"VLOOKUP($H21,$A$6:$E33,4,FALSE)","v":0},{"$f":"VLOOKUP($H21,$A$6:$E33,5,FALSE)","v":"Bye"}]
[16,null,null,null,null,null,16,{"$f":"IF(G22<=$C$3,Draw!A18,HLOOKUP($B$3,Draw!$E$2:$BQ$139,Entries!G22+1,FALSE))","v":2},{"$f":"VLOOKUP($H22,$A$6:$E34,2,FALSE)","v":"E. SHEPHERD"},{"$f":"VLOOKUP($H22,$A$6:$E34,3,FALSE)","v":0},{"$f":"VLOOKUP($H22,$A$6:$E34,4,FALSE)","v":0},{"$f":"VLOOKUP($H22,$A$6:$E34,5,FALSE)","v":"A. McGHEE"}]

{"sheet":"Draw","index":2,"n_rows":18,"n_cols":70,"rows_kept":18,"cut":false,"hidden":true,"merged":[[2,69,8,73]]}
["Hold down the \"Ctrl\" key and press \"a\" to conduct the draw.  "]
["Team No.","Random No.","Draw No.",null,8,9,10,11,12,13,14,15,16,25,26,27,28,29,30,31,32,49,50,51,52,53,54,55,56,57,58,59,60,61,62,63,64,97,98,99,100,101,102,103,104,105,106,107,108,109,110,111,112,113,114,115,116,117,118,119,120,121,122,123,124,125,126,127,128]
[{"$f":"IF(Entries!$E11=0,\" \",Entries!$A11)","v":5},{"$f":"IF(A3=\" \",\" \",RAND())","v":0.15840760845464397},{"$f":"IF(Entries!$E7=0,\" \",Entries!$A7)","v":1},null,null,null,null,null,null,null,null,null,null,null,null,null,null,null,null,null,null,null,null,null,null,null,null,null,null,null,null,null,null,null,null,null,null,null,null,null,null,null,null,null,null,null,null,null,null,null,null,null,null,null,null,null,null,null,null,null,null,null,null,null,null,null,null,null,null,"WARNING:-    PLEASE ONLY DO THE DRAW ONCE AS YOU WILL NOT BE ABLE TO RETURN TO THE PREVIOUS DRAW."]
[{"$f":"IF(Entries!$E10=0,\" \",Entries!$A10)","v":4},0.89387431450780508,{"$f":"IF(Entries!$E8=0,\" \",Entries!$A8)","v":2},null,{"$f":"$A$3","v":5}]
[{"$f":"IF(Entries!$E17=0,\" \",Entries!$A17)","v":11},0.89736303672179152,{"$f":"IF(Entries!$E9=0,\" \",Entries!$A9)","v":3}]
[{"$f":"IF(Entries!$E15=0,\" \",Entries!$A15)","v":9},2.4708916305665074E-2,{"$f":"IF(Entries!$E10=0,\" \",Entries!$A10)","v":4},null,{"$f":"$A$4","v":4},{"$f":"$A$5","v":11}]
[{"$f":"IF(Entries!$E9=0,\" \",Entries!$A9)","v":3},0.4010711520252942,{"$f":"IF(Entries!$E11=0,\" \",Entries!$A11)","v":5}]
[{"$f":"IF(Entries!$E16=0,\" \",Entries!$A16)","v":10},0.61474872265262681,{"$f":"IF(Entries!$E12=0,\" \",Entries!$A12)","v":6},null,{"$f":"$A$5","v":11},{"$f":"$A$6","v":9},{"$f":"$A$7","v":3}]
[{"$f":"IF(Entries!$E12=0,\" \",Entries!$A12)","v":6},0.96233933466834987,{"$f":"IF(Entries!$E13=0,\" \",Entries!$A13)","v":7}]
[{"$f":"IF(Entries!$E14=0,\" \",Entries!$A14)","v":8},0.75164750692547433,{"$f":"IF(Entries!$E14=0,\" \",Entries!$A14)","v":8},null,{"$f":"$A$6","v":9},{"$f":"$A$7","v":3},{"$f":"$A$8","v":10},{"$f":"$A$9","v":6}]
[{"$f":"IF(Entries!$E7=0,\" \",Entries!$A7)","v":1},0.5520338153709432,{"$f":"IF(Entries!$E15=0,\" \",Entries!$A15)","v":9}]
[{"$f":"IF(Entries!$E13=0,\" \",Entries!$A13)","v":7},0.54223198664267325,{"$f":"IF(Entries!$E16=0,\" \",Entries!$A16)","v":10},null,{"$f":"$A$7","v":3},{"$f":"$A$8","v":10},{"$f":"$A$9","v":6},{"$f":"$A$10","v":8},{"$f":"$A$11","v":1}]
[{"$f":"IF(Entries!$E8=0,\" \",Entries!$A8)","v":2},0.62988861732671819,{"$f":"IF(Entries!$E17=0,\" \",Entries!$A17)","v":11}]
[{"$f":"IF(Entries!$E18=0,\" \",Entries!$A18)","v":" "}," ",{"$f":"IF(Entries!$E18=0,\" \",Entries!$A18)","v":" "},null,{"$f":"$A$8","v":10},{"$f":"$A$9","v":6},{"$f":"$A$10","v":8},{"$f":"$A$11","v":1},{"$f":"$A$12","v":7},{"$f":"$A$13","v":2}]
[{"$f":"IF(Entries!$E19=0,\" \",Entries!$A19)","v":" "}," ",{"$f":"IF(Entries!$E19=0,\" \",Entries!$A19)","v":" "}]
[{"$f":"IF(Entries!$E20=0,\" \",Entries!$A20)","v":" "}," ",{"$f":"IF(Entries!$E20=0,\" \",Entries!$A20)","v":" "},null,{"$f":"$A$9","v":6},{"$f":"$A$10","v":8},{"$f":"$A$11","v":1},{"$f":"$A$12","v":7},{"$f":"$A$13","v":2},{"$f":"$A$14","v":" "},{"$f":"$A$15","v":" "}]
[{"$f":"IF(Entries!$E21=0,\" \",Entries!$A21)","v":" "}," ",{"$f":"IF(Entries!$E21=0,\" \",Entries!$A21)","v":" "}]
[{"$f":"IF(Entries!$E22=0,\" \",Entries!$A22)","v":" "}," ",{"$f":"IF(Entries!$E22=0,\" \",Entries!$A22)","v":" "},null,{"$f":"$A$10","v":8},{"$f":"$A$11","v":1},{"$f":"$A$12","v":7},{"$f":"$A$13","v":2},{"$f":"$A$14","v":" "},{"$f":"$A$15","v":" "},{"$f":"$A$16","v":" "},{"$f":"$A$17","v":" "}]

{"sheet":"Chart","index":3,"n_rows":82,"n_cols":13,"rows_kept":82,"cut":false,"hidden":false,"merged":[[4,8,4,9],[5,8,5,9],[4,10,4,11],[5,10,5,11],[47,7,50,7],[71,7,74,7],[57,7,60,7],[67,7,70,7],[4,6,4,7],[5,6,5,7],[22,11,25,11],[62,11,65,11],[51,7,54,7],[12,9,15,9],[32,9,35,9],[36,8,39,8],[32,8,35,8],[22,10,25,10],[26,10,29,10],[76,8,79,8],[72,8,75,8],[66,10,69,10],[62,10,65,10],[56,8,59,8],[52,8,55,8],[77,7,80,7],[81,5,84,5],[81,6,84,6],[52,9,55,9],[72,9,75,9],[77,5,80,5],[77,6,80,6],[71,6,74,6],[67,6,70,6],[77,0,80,0],[77,1,80,1],[77,2,80,2],[77,3,80,3],[71,5,74,5],[67,5,70,5],[81,0,84,0],[81,1,84,1],[81,2,84,2],[81,3,84,3],[81,4,84,4],[67,0,70,0],[67,1,70,1],[67,2,70,2],[67,3,70,3],[71,4,74,4],[67,4,70,4],[71,0,74,0],[71,1,74,1],[71,2,74,2],[71,3,74,3],[77,4,80,4],[61,4,64,4],[61,5,64,5],[61,6,64,6],[47,0,50,0],[47,1,50,1],[47,2,50,2],[47,3,50,3],[51,0,54,0],[51,1,54,1],[51,2,54,2],[57,4,60,4],[57,5,60,5],[57,6,60,6],[51,4,54,4],[51,5,54,5],[51,6,54,6],[57,0,60,0],[57,1,60,1],[57,2,60,2],[57,3,60,3],[61,0,64,0],[61,1,64,1],[61,2,64,2],[61,3,64,3],[41,0,44,0],[41,1,44,1],[41,2,44,2],[41,3,44,3],[51,3,54,3],[47,4,50,4],[47,5,50,5],[47,6,50,6],[41,4,44,4],[41,5,44,5],[41,6,44,6],[37,0,40,0],[37,1,40,1],[37,2,40,2],[37,3,40,3],[37,4,40,4],[37,5,40,5],[37,6,40,6],[37,7,40,7],[31,0,34,0],[31,1,34,1],[31,2,34,2],[31,3,34,3],[31,4,34,4],[31,5,34,5],[31,6,34,6],[31,7,34,7],[27,0,30,0],[27,1,30,1],[27,2,30,2],[27,3,30,3],[27,4,30,4],[27,5,30,5],[27,6,30,6],[27,7,30,7],[17,1,20,1],[17,2,20,2],[17,3,20,3],[17,4,20,4],[17,5,20,5],[17,6,20,6],[17,7,20,7],[21,0,24,0],[21,1,24,1],[21,2,24,2],[21,3,24,3],[21,4,24,4],[21,5,24,5],[21,6,24,6],[4,1,4,5],[42,8,45,11],[0,0,0,11],[1,0,1,11],[7,0,10,0],[7,1,10,1],[7,2,10,2],[7,3,10,3],[7,4,10,4],[5,1,5,5],[7,5,10,5],[7,6,10,6],[7,7,10,7],[11,0,14,0],[11,1,14,1],[11,2,14,2],[11,3,14,3],[11,4,14,4],[11,5,14,5],[11,6,14,6],[11,7,14,7],[12,8,15,8],[16,8,19,8],[17,0,20,0]]}
["BOWRAL BOWLS MIXED PAIRS 2022 10AM START"]
[]
[]
[]
[null,"1st Round",null,null,null,null,"Qtr Final",null,"Semi Final",null,"Final"]
[null,"SUNDAY, MARCH 13",null,null,null,null,"Sunday, March 20",null,"Sunday, March 27",null,"Sunday, April 3",null,"winner"]
[]
[1,{"$f":"Entries!$I$7","v":"A. MOORE"},{"$f":"Entries!$J$7","v":0},{"$f":"Entries!$K$7","v":0},{"$f":"Entries!$L$7","v":"T. BUTT"},null,{"$f":"IF(E8=\"Bye\",E12,IF(F8=F12,\"\",IF(F8=\"For\",E12,IF(F12=\"For\",E8,IF(F8>F12,E8,E12)))))","v":""}]
[]
[]
[]
[2,{"$f":"Entries!$I$8","v":"B. CROWLEY"},{"$f":"Entries!$J$8","v":0},{"$f":"Entries!$K$8","v":0},{"$f":"Entries!$L$8","v":"E. HALL"}]
[null,null,null,null,null,null,null,null,{"$f":"IF(H8=H18,\"\",IF(H8=\"For\",G18,IF(H18=\"For\",G8,IF(H8>H18,G8,G18))))","v":""}]
[]
[]
[]
[]
[3,{"$f":"Entries!$I$15","v":0},{"$f":"Entries!$J$9","v":0},{"$f":"Entries!$K$9","v":0},{"$f":"Entries!$L$15","v":"Bye"},null,{"$f":"IF(E18=\"Bye\",E22,IF(F18=F22,\"\",IF(F18=\"For\",E22,IF(F22=\"For\",E18,IF(F18>F22,E18,E22)))))","v":"N. BOYERS"}]
[]
[]
[]
[4,{"$f":"Entries!$I$16","v":"R. SOUTH"},{"$f":"Entries!$J$10","v":0},{"$f":"Entries!$K$10","v":0},{"$f":"Entries!$L$16","v":"N. BOYERS"}]
[null,null,null,null,null,null,null,null,null,null,{"$f":"IF(J13=J33,\"\",IF(J13=\"For\",I33,IF(J33=\"For\",I13,IF(J13>J33,I13,I33))))","v":""}]
[]
[]
[]
[]
[5,{"$f":"Entries!$I$11","v":"L. BOSHIER"},{"$f":"Entries!$J$11","v":0},{"$f":"Entries!$K$11","v":0},{"$f":"Entries!$L$11","v":"B. PORTER"},null,{"$f":"IF(E28=\"Bye\",E32,IF(F28=F32,\"\",IF(F28=\"For\",E32,IF(F32=\"For\",E28,IF(F28>F32,E28,E32)))))","v":""}]
[]
[]
[]
[6,{"$f":"Entries!$I$12","v":"J. HAYDEN"},{"$f":"Entries!$J$12","v":0},{"$f":"Entries!$K$12","v":0},{"$f":"Entries!$L$12","v":"K.STAFFORD"}]
[null,null,null,null,null,null,null,null,{"$f":"IF(H28=H38,\"\",IF(H28=\"For\",G38,IF(H38=\"For\",G28,IF(H28>H38,G28,G38))))","v":""}]
[]
[]
[]
[]
[7,{"$f":"Entries!$I$19","v":0},{"$f":"Entries!$J$13","v":0},{"$f":"Entries!$K$13","v":0},{"$f":"Entries!$L$19","v":"Bye"},null,{"$f":"IF(E38=\"Bye\",E42,IF(F38=F42,\"\",IF(F38=\"For\",E42,IF(F42=\"For\",E38,IF(F38>F42,E38,E42)))))","v":"C. SPILKER"}]
[]
[]
[]
[8,{"$f":"Entries!$I$20","v":"A. LAMB"},{"$f":"Entries!$J$14","v":0},{"$f":"Entries!$K$14","v":0},{"$f":"Entries!$L$20","v":"C. SPILKER"}]
[]
[]
[]
[]
[]
[9,{"$f":"Entries!$I$9","v":"J. NEELY"},{"$f":"Entries!$J$15","v":0},{"$f":"Entries!$K$15","v":0},{"$f":"Entries!$L$9","v":"G. FRASER"},null,{"$f":"IF(E48=\"Bye\",E52,IF(F48=F52,\"\",IF(F48=\"For\",E52,IF(F52=\"For\",E48,IF(F48>F52,E48,E52)))))","v":""}]
[]
[]
[]
[10,{"$f":"Entries!$I$10","v":"E. JONES"},{"$f":"Entries!$J$16","v":0},{"$f":"Entries!$K$16","v":0},{"$f":"Entries!$L$10","v":"B. EDWARDS"}]
[null,null,null,null,null,null,null,null,{"$f":"IF(H48=H58,\"\",IF(H48=\"For\",G58,IF(H58=\"For\",G48,IF(H48>H58,G48,G58))))","v":""}]
[]
[]
[]
[]
[11,{"$f":"Entries!$I$17","v":0},{"$f":"Entries!$J$17","v":0},{"$f":"Entries!$K$17","v":0},{"$f":"Entries!$L$17","v":"Bye"},null,{"$f":"IF(E58=\"Bye\",E62,IF(F58=F62,\"\",IF(F58=\"For\",E62,IF(F62=\"For\",E58,IF(F58>F62,E58,E62)))))","v":"B. CLAYTON"}]
[]
[]
[]
[12,{"$f":"Entries!$I$18","v":"A CONNOR"},{"$f":"Entries!$J$18","v":0},{"$f":"Entries!$K$18","v":0},{"$f":"Entries!$L$18","v":"B. CLAYTON"}]
[null,null,null,null,null,null,null,null,null,null,{"$f":"IF(J53=J73,\"\",IF(J53=\"For\",I73,IF(J73=\"For\",I53,IF(J53>J73,I53,I73))))","v":""}]
[]
[]
[]
[]
[13,{"$f":"Entries!$I$13","v":0},{"$f":"Entries!$J$19","v":0},{"$f":"Entries!$K$19","v":0},{"$f":"Entries!$L$13","v":"Bye"},null,{"$f":"IF(E68=\"Bye\",E72,IF(F68=F72,\"\",IF(F68=\"For\",E72,IF(F72=\"For\",E68,IF(F68>F72,E68,E72)))))","v":"E. BROWN"}]
[]
[]
[]
[14,{"$f":"Entries!$I$14","v":"D. COLEMAN"},{"$f":"Entries!$J$20","v":0},{"$f":"Entries!$K$20","v":0},{"$f":"Entries!$L$14","v":"E. BROWN"}]
[null,null,null,null,null,null,null,null,{"$f":"IF(H68=H78,\"\",IF(H68=\"For\",G78,IF(H78=\"For\",G68,IF(H68>H78,G68,G78))))","v":""}]
[]
[]
[]
[]
[15,{"$f":"Entries!$I$21","v":0},{"$f":"Entries!$J$21","v":0},{"$f":"Entries!$K$21","v":0},{"$f":"Entries!$L$21","v":"Bye"},null,{"$f":"IF(E78=\"Bye\",E82,IF(F78=F82,\"\",IF(F78=\"For\",E82,IF(F82=\"For\",E78,IF(F78>F82,E78,E82)))))","v":"A. McGHEE"}]
[]
[]
[]
[16,{"$f":"Entries!$I$22","v":"E. SHEPHERD"},{"$f":"Entries!$J$22","v":0},{"$f":"Entries!$K$22","v":0},{"$f":"Entries!$L$22","v":"A. McGHEE"}]

{"sheet":"R1","index":4,"n_rows":13,"n_cols":15,"rows_kept":13,"cut":false,"hidden":false,"merged":[[65,1,66,1],[65,8,66,8],[67,1,68,1],[67,8,68,8],[59,1,60,1],[59,8,60,8],[61,1,62,1],[61,8,62,8],[63,1,64,1],[63,8,64,8],[53,1,54,1],[53,8,54,8],[55,1,56,1],[55,8,56,8],[57,1,58,1],[57,8,58,8],[47,1,48,1],[47,8,48,8],[49,1,50,1],[49,8,50,8],[51,1,52,1],[51,8,52,8],[41,1,42,1],[41,8,42,8],[43,1,44,1],[43,8,44,8],[45,1,46,1],[45,8,46,8],[19,1,20,1],[19,8,20,8],[21,1,22,1],[21,8,22,8],[39,1,40,1],[39,8,40,8],[13,1,14,1],[13,8,14,8],[15,1,16,1],[15,8,16,8],[17,1,18,1],[17,8,18,8],[7,1,8,1],[7,8,8,8],[9,1,10,1],[9,8,10,8],[11,1,12,1],[11,8,12,8],[1,1,1,14],[0,1,0,14],[2,1,2,14],[3,1,3,14],[5,1,6,1],[5,8,6,8]]}
[null,{"$f":"Chart!$A$1","v":"BOWRAL BOWLS MIXED PAIRS 2022 10AM START"}]
[null,"Men's Pairs - Round 1"]
[null,"2013-07-06"]
[null,"Roll up at 12.40pm for 1.00pm Start"]
[null,"Match No.",null,null,"Match No.",null,null,null,"Match No."]
[null,1,{"$f":"Chart!$B$8","v":"A. MOORE"},{"$f":"Chart!$C$8","v":0},null,null,null,{"$f":"Chart!$E$8","v":"T. BUTT"},2,{"$f":"Chart!$B$18","v":0},{"$f":"Chart!$C$18","v":0},null,{"$f":"Chart!$D$18","v":0},null,{"$f":"Chart!$E$18","v":"Bye"}]
[null,null,{"$f":"Chart!$B$12","v":"B. CROWLEY"},{"$f":"Chart!$C$12","v":0},null,{"$f":"Chart!$D$12","v":0},null,{"$f":"Chart!$E$12","v":"E. HALL"},7,{"$f":"Chart!$B$22","v":"R. SOUTH"},{"$f":"Chart!$C$22","v":0},null,{"$f":"Chart!$D$22","v":0},null,{"$f":"Chart!$E$22","v":"N. BOYERS"}]
[null,3,{"$f":"Chart!$B$28","v":"L. BOSHIER"},{"$f":"Chart!$C$28","v":0},null,{"$f":"Chart!$D$28","v":0},null,{"$f":"Chart!$E$28","v":"B. PORTER"},4,{"$f":"Chart!$B$38","v":0},{"$f":"Chart!$C$38","v":0},null,{"$f":"Chart!$D$38","v":0},null,{"$f":"Chart!$E$38","v":"Bye"}]
[null,11,{"$f":"Chart!$B$32","v":"J. HAYDEN"},{"$f":"Chart!$C$32","v":0},null,{"$f":"Chart!$D$32","v":0},null,{"$f":"Chart!$E$32","v":"K.STAFFORD"},15,{"$f":"Chart!$B$42","v":"A. LAMB"},{"$f":"Chart!$C$42","v":0},null,{"$f":"Chart!$D$42","v":0},null,{"$f":"Chart!$E$42","v":"C. SPILKER"}]
[null,5,{"$f":"Chart!$B$48","v":"J. NEELY"},{"$f":"Chart!$C$48","v":0},null,{"$f":"Chart!$D$48","v":0},null,{"$f":"Chart!$E$48","v":"G. FRASER"},6,{"$f":"Chart!$B$58","v":0},{"$f":"Chart!$C$58","v":0},null,{"$f":"Chart!$D$58","v":0},null,{"$f":"Chart!$E$58","v":"Bye"}]
[null,19,{"$f":"Chart!$B$52","v":"E. JONES"},{"$f":"Chart!$C$52","v":0},null,{"$f":"Chart!$D$52","v":0},null,{"$f":"Chart!$E$52","v":"B. EDWARDS"},23,{"$f":"Chart!$B$62","v":"A CONNOR"},{"$f":"Chart!$C$62","v":0},null,{"$f":"Chart!$D$62","v":0},null,{"$f":"Chart!$E$62","v":"B. CLAYTON"}]
[null,7,{"$f":"Chart!$B$68","v":0},{"$f":"Chart!$C$68","v":0},null,{"$f":"Chart!$D$68","v":0},null,{"$f":"Chart!$E$68","v":"Bye"},8,{"$f":"Chart!$B$78","v":0},{"$f":"Chart!$C$78","v":0},null,{"$f":"Chart!$D$78","v":0},null,{"$f":"Chart!$E$78","v":"Bye"}]
[null,27,{"$f":"Chart!$B$72","v":"D. COLEMAN"},{"$f":"Chart!$C$72","v":0},null,{"$f":"Chart!$D$72","v":0},null,{"$f":"Chart!$E$72","v":"E. BROWN"},31,{"$f":"Chart!$B$82","v":"E. SHEPHERD"},{"$f":"Chart!$C$82","v":0},null,{"$f":"Chart!$D$82","v":0},null,{"$f":"Chart!$E$82","v":"A. McGHEE"}]

{"sheet":"Q-Final","index":5,"n_rows":133,"n_cols":24,"rows_kept":133,"cut":false,"hidden":false,"merged":[[67,1,68,1],[57,1,58,1],[59,1,60,1],[61,1,62,1],[63,1,64,1],[65,1,66,1],[47,1,48,1],[49,1,50,1],[51,1,52,1],[53,1,54,1],[55,1,56,1],[37,1,38,1],[39,1,40,1],[41,1,42,1],[43,1,44,1],[45,1,46,1],[27,1,28,1],[29,1,30,1],[31,1,32,1],[33,1,34,1],[35,1,36,1],[17,1,18,1],[19,1,20,1],[21,1,22,1],[23,1,24,1],[25,1,26,1],[7,1,8,1],[9,1,10,1],[11,1,12,1],[13,1,14,1],[15,1,16,1],[0,1,0,7],[1,1,1,7],[2,1,2,7],[3,1,3,7],[5,1,6,1]]}
[null,{"$f":"Chart!$A$1","v":"BOWRAL BOWLS MIXED PAIRS 2022 10AM START"}]
[null,"Men's Pairs - Quarter Final"]
[null,"2013-07-06"]
[null,"Roll up at 12.40pm for 1.00pm Start"]
[null,"Match No.",null,null,"Match No."]
[null,1,{"$f":"VLOOKUP($H6,U6:X133,4,FALSE)","v":{"$error":"#N/A"}},{"$f":"VLOOKUP($H6,U6:X133,3,FALSE)","v":{"$error":"#N/A"}},null,{"$f":"VLOOKUP($H6,U6:X133,2,FALSE)","v":{"$error":"#N/A"}},{"$f":"Chart!$B$8","v":"A. MOORE"},{"$f":"Chart!$G$8","v":""},null,null,null,null,null,null,null,null,null,null,null,null,{"$f":"Chart!$E$8","v":"T. BUTT"},{"$f":"Chart!$D$8","v":0},{"$f":"Chart!$C$8","v":0},{"$f":"Chart!$B$8","v":"A. MOORE"}]
[null,null,"R. SOUTH",0,null,0,null,{"$f":"Chart!$G$18","v":"N. BOYERS"},null,null,null,null,null,null,null,null,null,null,null,null,{"$f":"Chart!$E$12","v":"E. HALL"},{"$f":"Chart!$D$12","v":0},{"$f":"Chart!$C$12","v":0},{"$f":"Chart!$B$12","v":"B. CROWLEY"}]
[null,2,{"$error":"#N/A"},{"$error":"#N/A"},null,{"$error":"#N/A"},null,{"$f":"Chart!$G$28","v":""},null,null,null,null,null,null,null,null,null,null,null,null,{"$f":"Chart!$E$18","v":"Bye"},{"$f":"Chart!$D$18","v":0},{"$f":"Chart!$C$18","v":0},{"$f":"Chart!$B$18","v":0}]
[null,7,"A. LAMB",0,null,0,null,{"$f":"Chart!$G$38","v":"C. SPILKER"},null,null,null,null,null,null,null,null,null,null,null,null,{"$f":"Chart!$E$22","v":"N. BOYERS"},{"$f":"Chart!$D$22","v":0},{"$f":"Chart!$C$22","v":0},{"$f":"Chart!$B$22","v":"R. SOUTH"}]
[null,3,{"$error":"#N/A"},{"$error":"#N/A"},null,{"$error":"#N/A"},null,{"$f":"Chart!$G$48","v":""},null,null,null,null,null,null,null,null,null,null,null,null,{"$f":"Chart!$E$28","v":"B. PORTER"},{"$f":"Chart!$D$28","v":0},{"$f":"Chart!$C$28","v":0},{"$f":"Chart!$B$28","v":"L. BOSHIER"}]
[null,11,"A CONNOR",0,null,0,null,{"$f":"Chart!$G$58","v":"B. CLAYTON"},null,null,null,null,null,null,null,null,null,null,null,null,{"$f":"Chart!$E$32","v":"K.STAFFORD"},{"$f":"Chart!$D$32","v":0},{"$f":"Chart!$C$32","v":0},{"$f":"Chart!$B$32","v":"J. HAYDEN"}]
[null,4,"D. COLEMAN",0,null,0,null,{"$f":"Chart!$G$68","v":"E. BROWN"},null,null,null,null,null,null,null,null,null,null,null,null,{"$f":"Chart!$E$38","v":"Bye"},{"$f":"Chart!$D$38","v":0},{"$f":"Chart!$C$38","v":0},{"$f":"Chart!$B$38","v":0}]
[null,15,"E. SHEPHERD",0,null,0,null,{"$f":"Chart!$G$78","v":"A. McGHEE"},null,null,null,null,null,null,null,null,null,null,null,null,{"$f":"Chart!$E$42","v":"C. SPILKER"},{"$f":"Chart!$D$42","v":0},{"$f":"Chart!$C$42","v":0},{"$f":"Chart!$B$42","v":"A. LAMB"}]
[null,null,null,null,null,null,null,null,null,null,null,null,null,null,null,null,null,null,null,null,{"$f":"Chart!$E$48","v":"G. FRASER"},{"$f":"Chart!$D$48","v":0},{"$f":"Chart!$C$48","v":0},{"$f":"Chart!$B$48","v":"J. NEELY"}]
[null,null,null,null,null,null,null,null,null,null,null,null,null,null,null,null,null,null,null,null,{"$f":"Chart!$E$52","v":"B. EDWARDS"},{"$f":"Chart!$D$52","v":0},{"$f":"Chart!$C$52","v":0},{"$f":"Chart!$B$52","v":"E. JONES"}]
[null,null,null,null,null,null,null,null,null,null,null,null,null,null,null,null,null,null,null,null,{"$f":"Chart!$E$58","v":"Bye"},{"$f":"Chart!$D$58","v":0},{"$f":"Chart!$C$58","v":0},{"$f":"Chart!$B$58","v":0}]
[null,null,null,null,null,null,null,null,null,null,null,null,null,null,null,null,null,null,null,null,{"$f":"Chart!$E$62","v":"B. CLAYTON"},{"$f":"Chart!$D$62","v":0},{"$f":"Chart!$C$62","v":0},{"$f":"Chart!$B$62","v":"A CONNOR"}]
[null,null,null,null,null,null,null,null,null,null,null,null,null,null,null,null,null,null,null,null,{"$f":"Chart!$E$68","v":"Bye"},{"$f":"Chart!$D$68","v":0},{"$f":"Chart!$C$68","v":0},{"$f":"Chart!$B$68","v":0}]
[null,null,null,null,null,null,null,null,null,null,null,null,null,null,null,null,null,null,null,null,{"$f":"Chart!$E$72","v":"E. BROWN"},{"$f":"Chart!$D$72","v":0},{"$f":"Chart!$C$72","v":0},{"$f":"Chart!$B$72","v":"D. COLEMAN"}]
[null,null,null,null,null,null,null,null,null,null,null,null,null,null,null,null,null,null,null,null,{"$f":"Chart!$E$78","v":"Bye"},{"$f":"Chart!$D$78","v":0},{"$f":"Chart!$C$78","v":0},{"$f":"Chart!$B$78","v":0}]
[null,null,null,null,null,null,null,null,null,null,null,null,null,null,null,null,null,null,null,null,{"$f":"Chart!$E$82","v":"A. McGHEE"},{"$f":"Chart!$D$82","v":0},{"$f":"Chart!$C$82","v":0},{"$f":"Chart!$B$82","v":"E. SHEPHERD"}]
[null,null,null,null,null,null,null,null,null,null,null,null,null,null,null,null,null,null,null,null,{"$f":"Chart!#REF!","v":{"$error":"#REF!"}},{"$f":"Chart!#REF!","v":{"$error":"#REF!"}},{"$f":"Chart!#REF!","v":{"$error":"#REF!"}},{"$f":"Chart!#REF!","v":{"$error":"#REF!"}}]
[null,null,null,null,null,null,null,null,null,null,null,null,null,null,null,null,null,null,null,null,{"$f":"Chart!#REF!","v":{"$error":"#REF!"}},{"$f":"Chart!#REF!","v":{"$error":"#REF!"}},{"$f":"Chart!#REF!","v":{"$error":"#REF!"}},{"$f":"Chart!#REF!","v":{"$error":"#REF!"}}]
[null,null,null,null,null,null,null,null,null,null,null,null,null,null,null,null,null,null,null,null,{"$f":"Chart!#REF!","v":{"$error":"#REF!"}},{"$f":"Chart!#REF!","v":{"$error":"#REF!"}},{"$f":"Chart!#REF!","v":{"$error":"#REF!"}},{"$f":"Chart!#REF!","v":{"$error":"#REF!"}}]
[null,null,null,null,null,null,null,null,null,null,null,null,null,null,null,null,null,null,null,null,{"$f":"Chart!#REF!","v":{"$error":"#REF!"}},{"$f":"Chart!#REF!","v":{"$error":"#REF!"}},{"$f":"Chart!#REF!","v":{"$error":"#REF!"}},{"$f":"Chart!#REF!","v":{"$error":"#REF!"}}]
[null,null,null,null,null,null,null,null,null,null,null,null,null,null,null,null,null,null,null,null,{"$f":"Chart!#REF!","v":{"$error":"#REF!"}},{"$f":"Chart!#REF!","v":{"$error":"#REF!"}},{"$f":"Chart!#REF!","v":{"$error":"#REF!"}},{"$f":"Chart!#REF!","v":{"$error":"#REF!"}}]
[null,null,null,null,null,null,null,null,null,null,null,null,null,null,null,null,null,null,null,null,{"$f":"Chart!#REF!","v":{"$error":"#REF!"}},{"$f":"Chart!#REF!","v":{"$error":"#REF!"}},{"$f":"Chart!#REF!","v":{"$error":"#REF!"}},{"$f":"Chart!#REF!","v":{"$error":"#REF!"}}]
[null,null,null,null,null,null,null,null,null,null,null,null,null,null,null,null,null,null,null,null,{"$f":"Chart!#REF!","v":{"$error":"#REF!"}},{"$f":"Chart!#REF!","v":{"$error":"#REF!"}},{"$f":"Chart!#REF!","v":{"$error":"#REF!"}},{"$f":"Chart!#REF!","v":{"$error":"#REF!"}}]
[null,null,null,null,null,null,null,null,null,null,null,null,null,null,null,null,null,null,null,null,{"$f":"Chart!#REF!","v":{"$error":"#REF!"}},{"$f":"Chart!#REF!","v":{"$error":"#REF!"}},{"$f":"Chart!#REF!","v":{"$error":"#REF!"}},{"$f":"Chart!#REF!","v":{"$error":"#REF!"}}]
[null,null,null,null,null,null,null,null,null,null,null,null,null,null,null,null,null,null,null,null,{"$f":"Chart!#REF!","v":{"$error":"#REF!"}},{"$f":"Chart!#REF!","v":{"$error":"#REF!"}},{"$f":"Chart!#REF!","v":{"$error":"#REF!"}},{"$f":"Chart!#REF!","v":{"$error":"#REF!"}}]
[null,null,null,null,null,null,null,null,null,null,null,null,null,null,null,null,null,null,null,null,{"$f":"Chart!#REF!","v":{"$error":"#REF!"}},{"$f":"Chart!#REF!","v":{"$error":"#REF!"}},{"$f":"Chart!#REF!","v":{"$error":"#REF!"}},{"$f":"Chart!#REF!","v":{"$error":"#REF!"}}]
[null,null,null,null,null,null,null,null,null,null,null,null,null,null,null,null,null,null,null,null,{"$f":"Chart!#REF!","v":{"$error":"#REF!"}},{"$f":"Chart!#REF!","v":{"$error":"#REF!"}},{"$f":"Chart!#REF!","v":{"$error":"#REF!"}},{"$f":"Chart!#REF!","v":{"$error":"#REF!"}}]
[null,null,null,null,null,null,null,null,null,null,null,null,null,null,null,null,null,null,null,null,{"$f":"Chart!#REF!","v":{"$error":"#REF!"}},{"$f":"Chart!#REF!","v":{"$error":"#REF!"}},{"$f":"Chart!#REF!","v":{"$error":"#REF!"}},{"$f":"Chart!#REF!","v":{"$error":"#REF!"}}]
[null,null,null,null,null,null,null,null,null,null,null,null,null,null,null,null,null,null,null,null,{"$f":"Chart!#REF!","v":{"$error":"#REF!"}},{"$f":"Chart!#REF!","v":{"$error":"#REF!"}},{"$f":"Chart!#REF!","v":{"$error":"#REF!"}},{"$f":"Chart!#REF!","v":{"$error":"#REF!"}}]
[null,null,null,null,null,null,null,null,null,null,null,null,null,null,null,null,null,null,null,null,{"$f":"Chart!#REF!","v":{"$error":"#REF!"}},{"$f":"Chart!#REF!","v":{"$error":"#REF!"}},{"$f":"Chart!#REF!","v":{"$error":"#REF!"}},{"$f":"Chart!#REF!","v":{"$error":"#REF!"}}]
[null,null,null,null,null,null,null,null,null,null,null,null,null,null,null,null,null,null,null,null,{"$f":"Chart!#REF!","v":{"$error":"#REF!"}},{"$f":"Chart!#REF!","v":{"$error":"#REF!"}},{"$f":"Chart!#REF!","v":{"$error":"#REF!"}},{"$f":"Chart!#REF!","v":{"$error":"#REF!"}}]
[null,null,null,null,null,null,null,null,null,null,null,null,null,null,null,null,null,null,null,null,{"$f":"Chart!#REF!","v":{"$error":"#REF!"}},{"$f":"Chart!#REF!","v":{"$error":"#REF!"}},{"$f":"Chart!#REF!","v":{"$error":"#REF!"}},{"$f":"Chart!#REF!","v":{"$error":"#REF!"}}]
[null,null,null,null,null,null,null,null,null,null,null,null,null,null,null,null,null,null,null,null,{"$f":"Chart!#REF!","v":{"$error":"#REF!"}},{"$f":"Chart!#REF!","v":{"$error":"#REF!"}},{"$f":"Chart!#REF!","v":{"$error":"#REF!"}},{"$f":"Chart!#REF!","v":{"$error":"#REF!"}}]
[null,null,null,null,null,null,null,null,null,null,null,null,null,null,null,null,null,null,null,null,{"$f":"Chart!#REF!","v":{"$error":"#REF!"}},{"$f":"Chart!#REF!","v":{"$error":"#REF!"}},{"$f":"Chart!#REF!","v":{"$error":"#REF!"}},{"$f":"Chart!#REF!","v":{"$error":"#REF!"}}]
[null,null,null,null,null,null,null,null,null,null,null,null,null,null,null,null,null,null,null,null,{"$f":"Chart!#REF!","v":{"$error":"#REF!"}},{"$f":"Chart!#REF!","v":{"$error":"#REF!"}},{"$f":"Chart!#REF!","v":{"$error":"#REF!"}},{"$f":"Chart!#REF!","v":{"$error":"#REF!"}}]
[null,null,null,null,null,null,null,null,null,null,null,null,null,null,null,null,null,null,null,null,{"$f":"Chart!#REF!","v":{"$error":"#REF!"}},{"$f":"Chart!#REF!","v":{"$error":"#REF!"}},{"$f":"Chart!#REF!","v":{"$error":"#REF!"}},{"$f":"Chart!#REF!","v":{"$error":"#REF!"}}]
[null,null,null,null,null,null,null,null,null,null,null,null,null,null,null,null,null,null,null,null,{"$f":"Chart!#REF!","v":{"$error":"#REF!"}},{"$f":"Chart!#REF!","v":{"$error":"#REF!"}},{"$f":"Chart!#REF!","v":{"$error":"#REF!"}},{"$f":"Chart!#REF!","v":{"$error":"#REF!"}}]
[null,null,null,null,null,null,null,null,null,null,null,null,null,null,null,null,null,null,null,null,{"$f":"Chart!#REF!","v":{"$error":"#REF!"}},{"$f":"Chart!#REF!","v":{"$error":"#REF!"}},{"$f":"Chart!#REF!","v":{"$error":"#REF!"}},{"$f":"Chart!#REF!","v":{"$error":"#REF!"}}]
[null,null,null,null,null,null,null,null,null,null,null,null,null,null,null,null,null,null,null,null,{"$f":"Chart!#REF!","v":{"$error":"#REF!"}},{"$f":"Chart!#REF!","v":{"$error":"#REF!"}},{"$f":"Chart!#REF!","v":{"$error":"#REF!"}},{"$f":"Chart!#REF!","v":{"$error":"#REF!"}}]
[null,null,null,null,null,null,null,null,null,null,null,null,null,null,null,null,null,null,null,null,{"$f":"Chart!#REF!","v":{"$error":"#REF!"}},{"$f":"Chart!#REF!","v":{"$error":"#REF!"}},{"$f":"Chart!#REF!","v":{"$error":"#REF!"}},{"$f":"Chart!#REF!","v":{"$error":"#REF!"}}]
[null,null,null,null,null,null,null,null,null,null,null,null,null,null,null,null,null,null,null,null,{"$f":"Chart!#REF!","v":{"$error":"#REF!"}},{"$f":"Chart!#REF!","v":{"$error":"#REF!"}},{"$f":"Chart!#REF!","v":{"$error":"#REF!"}},{"$f":"Chart!#REF!","v":{"$error":"#REF!"}}]
[null,null,null,null,null,null,null,null,null,null,null,null,null,null,null,null,null,null,null,null,{"$f":"Chart!#REF!","v":{"$error":"#REF!"}},{"$f":"Chart!#REF!","v":{"$error":"#REF!"}},{"$f":"Chart!#REF!","v":{"$error":"#REF!"}},{"$f":"Chart!#REF!","v":{"$error":"#REF!"}}]
[null,null,null,null,null,null,null,null,null,null,null,null,null,null,null,null,null,null,null,null,{"$f":"Chart!#REF!","v":{"$error":"#REF!"}},{"$f":"Chart!#REF!","v":{"$error":"#REF!"}},{"$f":"Chart!#REF!","v":{"$error":"#REF!"}},{"$f":"Chart!#REF!","v":{"$error":"#REF!"}}]
[null,null,null,null,null,null,null,null,null,null,null,null,null,null,null,null,null,null,null,null,{"$f":"Chart!#REF!","v":{"$error":"#REF!"}},{"$f":"Chart!#REF!","v":{"$error":"#REF!"}},{"$f":"Chart!#REF!","v":{"$error":"#REF!"}},{"$f":"Chart!#REF!","v":{"$error":"#REF!"}}]
[null,null,null,null,null,null,null,null,null,null,null,null,null,null,null,null,null,null,null,null,{"$f":"Chart!#REF!","v":{"$error":"#REF!"}},{"$f":"Chart!#REF!","v":{"$error":"#REF!"}},{"$f":"Chart!#REF!","v":{"$error":"#REF!"}},{"$f":"Chart!#REF!","v":{"$error":"#REF!"}}]
[null,null,null,null,null,null,null,null,null,null,null,null,null,null,null,null,null,null,null,null,{"$f":"Chart!#REF!","v":{"$error":"#REF!"}},{"$f":"Chart!#REF!","v":{"$error":"#REF!"}},{"$f":"Chart!#REF!","v":{"$error":"#REF!"}},{"$f":"Chart!#REF!","v":{"$error":"#REF!"}}]
[null,null,null,null,null,null,null,null,null,null,null,null,null,null,null,null,null,null,null,null,{"$f":"Chart!#REF!","v":{"$error":"#REF!"}},{"$f":"Chart!#REF!","v":{"$error":"#REF!"}},{"$f":"Chart!#REF!","v":{"$error":"#REF!"}},{"$f":"Chart!#REF!","v":{"$error":"#REF!"}}]
[null,null,null,null,null,null,null,null,null,null,null,null,null,null,null,null,null,null,null,null,{"$f":"Chart!#REF!","v":{"$error":"#REF!"}},{"$f":"Chart!#REF!","v":{"$error":"#REF!"}},{"$f":"Chart!#REF!","v":{"$error":"#REF!"}},{"$f":"Chart!#REF!","v":{"$error":"#REF!"}}]
[null,null,null,null,null,null,null,null,null,null,null,null,null,null,null,null,null,null,null,null,{"$f":"Chart!#REF!","v":{"$error":"#REF!"}},{"$f":"Chart!#REF!","v":{"$error":"#REF!"}},{"$f":"Chart!#REF!","v":{"$error":"#REF!"}},{"$f":"Chart!#REF!","v":{"$error":"#REF!"}}]
[null,null,null,null,null,null,null,null,null,null,null,null,null,null,null,null,null,null,null,null,{"$f":"Chart!#REF!","v":{"$error":"#REF!"}},{"$f":"Chart!#REF!","v":{"$error":"#REF!"}},{"$f":"Chart!#REF!","v":{"$error":"#REF!"}},{"$f":"Chart!#REF!","v":{"$error":"#REF!"}}]
[null,null,null,null,null,null,null,null,null,null,null,null,null,null,null,null,null,null,null,null,{"$f":"Chart!#REF!","v":{"$error":"#REF!"}},{"$f":"Chart!#REF!","v":{"$error":"#REF!"}},{"$f":"Chart!#REF!","v":{"$error":"#REF!"}},{"$f":"Chart!#REF!","v":{"$error":"#REF!"}}]
[null,null,null,null,null,null,null,null,null,null,null,null,null,null,null,null,null,null,null,null,{"$f":"Chart!#REF!","v":{"$error":"#REF!"}},{"$f":"Chart!#REF!","v":{"$error":"#REF!"}},{"$f":"Chart!#REF!","v":{"$error":"#REF!"}},{"$f":"Chart!#REF!","v":{"$error":"#REF!"}}]
[null,null,null,null,null,null,null,null,null,null,null,null,null,null,null,null,null,null,null,null,{"$f":"Chart!#REF!","v":{"$error":"#REF!"}},{"$f":"Chart!#REF!","v":{"$error":"#REF!"}},{"$f":"Chart!#REF!","v":{"$error":"#REF!"}},{"$f":"Chart!#REF!","v":{"$error":"#REF!"}}]
[null,null,null,null,null,null,null,null,null,null,null,null,null,null,null,null,null,null,null,null,{"$f":"Chart!#REF!","v":{"$error":"#REF!"}},{"$f":"Chart!#REF!","v":{"$error":"#REF!"}},{"$f":"Chart!#REF!","v":{"$error":"#REF!"}},{"$f":"Chart!#REF!","v":{"$error":"#REF!"}}]
[null,null,null,null,null,null,null,null,null,null,null,null,null,null,null,null,null,null,null,null,{"$f":"Chart!#REF!","v":{"$error":"#REF!"}},{"$f":"Chart!#REF!","v":{"$error":"#REF!"}},{"$f":"Chart!#REF!","v":{"$error":"#REF!"}},{"$f":"Chart!#REF!","v":{"$error":"#REF!"}}]
[null,null,null,null,null,null,null,null,null,null,null,null,null,null,null,null,null,null,null,null,{"$f":"Chart!#REF!","v":{"$error":"#REF!"}},{"$f":"Chart!#REF!","v":{"$error":"#REF!"}},{"$f":"Chart!#REF!","v":{"$error":"#REF!"}},{"$f":"Chart!#REF!","v":{"$error":"#REF!"}}]
[null,null,null,null,null,null,null,null,null,null,null,null,null,null,null,null,null,null,null,null,{"$f":"Chart!#REF!","v":{"$error":"#REF!"}},{"$f":"Chart!#REF!","v":{"$error":"#REF!"}},{"$f":"Chart!#REF!","v":{"$error":"#REF!"}},{"$f":"Chart!#REF!","v":{"$error":"#REF!"}}]
[null,null,null,null,null,null,null,null,null,null,null,null,null,null,null,null,null,null,null,null,{"$f":"Chart!#REF!","v":{"$error":"#REF!"}},{"$f":"Chart!#REF!","v":{"$error":"#REF!"}},{"$f":"Chart!#REF!","v":{"$error":"#REF!"}},{"$f":"Chart!#REF!","v":{"$error":"#REF!"}}]
[null,null,null,null,null,null,null,null,null,null,null,null,null,null,null,null,null,null,null,null,{"$f":"Chart!#REF!","v":{"$error":"#REF!"}},{"$f":"Chart!#REF!","v":{"$error":"#REF!"}},{"$f":"Chart!#REF!","v":{"$error":"#REF!"}},{"$f":"Chart!#REF!","v":{"$error":"#REF!"}}]
[null,null,null,null,null,null,null,null,null,null,null,null,null,null,null,null,null,null,null,null,{"$f":"Chart!#REF!","v":{"$error":"#REF!"}},{"$f":"Chart!#REF!","v":{"$error":"#REF!"}},{"$f":"Chart!#REF!","v":{"$error":"#REF!"}},{"$f":"Chart!#REF!","v":{"$error":"#REF!"}}]
[null,null,null,null,null,null,null,null,null,null,null,null,null,null,null,null,null,null,null,null,{"$f":"Chart!#REF!","v":{"$error":"#REF!"}},{"$f":"Chart!#REF!","v":{"$error":"#REF!"}},{"$f":"Chart!#REF!","v":{"$error":"#REF!"}},{"$f":"Chart!#REF!","v":{"$error":"#REF!"}}]
[null,null,null,null,null,null,null,null,null,null,null,null,null,null,null,null,null,null,null,null,{"$f":"Chart!#REF!","v":{"$error":"#REF!"}},{"$f":"Chart!#REF!","v":{"$error":"#REF!"}},{"$f":"Chart!#REF!","v":{"$error":"#REF!"}},{"$f":"Chart!#REF!","v":{"$error":"#REF!"}}]
[null,null,null,null,null,null,null,null,null,null,null,null,null,null,null,null,null,null,null,null,{"$f":"Chart!#REF!","v":{"$error":"#REF!"}},{"$f":"Chart!#REF!","v":{"$error":"#REF!"}},{"$f":"Chart!#REF!","v":{"$error":"#REF!"}},{"$f":"Chart!#REF!","v":{"$error":"#REF!"}}]
[null,null,null,null,null,null,null,null,null,null,null,null,null,null,null,null,null,null,null,null,{"$f":"Chart!#REF!","v":{"$error":"#REF!"}},{"$f":"Chart!#REF!","v":{"$error":"#REF!"}},{"$f":"Chart!#REF!","v":{"$error":"#REF!"}},{"$f":"Chart!#REF!","v":{"$error":"#REF!"}}]
[null,null,null,null,null,null,null,null,null,null,null,null,null,null,null,null,null,null,null,null,{"$f":"Chart!#REF!","v":{"$error":"#REF!"}},{"$f":"Chart!#REF!","v":{"$error":"#REF!"}},{"$f":"Chart!#REF!","v":{"$error":"#REF!"}},{"$f":"Chart!#REF!","v":{"$error":"#REF!"}}]
[null,null,null,null,null,null,null,null,null,null,null,null,null,null,null,null,null,null,null,null,{"$f":"Chart!#REF!","v":{"$error":"#REF!"}},{"$f":"Chart!#REF!","v":{"$error":"#REF!"}},{"$f":"Chart!#REF!","v":{"$error":"#REF!"}},{"$f":"Chart!#REF!","v":{"$error":"#REF!"}}]
[null,null,null,null,null,null,null,null,null,null,null,null,null,null,null,null,null,null,null,null,{"$f":"Chart!#REF!","v":{"$error":"#REF!"}},{"$f":"Chart!#REF!","v":{"$error":"#REF!"}},{"$f":"Chart!#REF!","v":{"$error":"#REF!"}},{"$f":"Chart!#REF!","v":{"$error":"#REF!"}}]
[null,null,null,null,null,null,null,null,null,null,null,null,null,null,null,null,null,null,null,null,{"$f":"Chart!#REF!","v":{"$error":"#REF!"}},{"$f":"Chart!#REF!","v":{"$error":"#REF!"}},{"$f":"Chart!#REF!","v":{"$error":"#REF!"}},{"$f":"Chart!#REF!","v":{"$error":"#REF!"}}]
[null,null,null,null,null,null,null,null,null,null,null,null,null,null,null,null,null,null,null,null,{"$f":"Chart!#REF!","v":{"$error":"#REF!"}},{"$f":"Chart!#REF!","v":{"$error":"#REF!"}},{"$f":"Chart!#REF!","v":{"$error":"#REF!"}},{"$f":"Chart!#REF!","v":{"$error":"#REF!"}}]
[null,null,null,null,null,null,null,null,null,null,null,null,null,null,null,null,null,null,null,null,{"$f":"Chart!#REF!","v":{"$error":"#REF!"}},{"$f":"Chart!#REF!","v":{"$error":"#REF!"}},{"$f":"Chart!#REF!","v":{"$error":"#REF!"}},{"$f":"Chart!#REF!","v":{"$error":"#REF!"}}]
[null,null,null,null,null,null,null,null,null,null,null,null,null,null,null,null,null,null,null,null,{"$f":"Chart!#REF!","v":{"$error":"#REF!"}},{"$f":"Chart!#REF!","v":{"$error":"#REF!"}},{"$f":"Chart!#REF!","v":{"$error":"#REF!"}},{"$f":"Chart!#REF!","v":{"$error":"#REF!"}}]
[null,null,null,null,null,null,null,null,null,null,null,null,null,null,null,null,null,null,null,null,{"$f":"Chart!#REF!","v":{"$error":"#REF!"}},{"$f":"Chart!#REF!","v":{"$error":"#REF!"}},{"$f":"Chart!#REF!","v":{"$error":"#REF!"}},{"$f":"Chart!#REF!","v":{"$error":"#REF!"}}]
[null,null,null,null,null,null,null,null,null,null,null,null,null,null,null,null,null,null,null,null,{"$f":"Chart!#REF!","v":{"$error":"#REF!"}},{"$f":"Chart!#REF!","v":{"$error":"#REF!"}},{"$f":"Chart!#REF!","v":{"$error":"#REF!"}},{"$f":"Chart!#REF!","v":{"$error":"#REF!"}}]
[null,null,null,null,null,null,null,null,null,null,null,null,null,null,null,null,null,null,null,null,{"$f":"Chart!#REF!","v":{"$error":"#REF!"}},{"$f":"Chart!#REF!","v":{"$error":"#REF!"}},{"$f":"Chart!#REF!","v":{"$error":"#REF!"}},{"$f":"Chart!#REF!","v":{"$error":"#REF!"}}]
[null,null,null,null,null,null,null,null,null,null,null,null,null,null,null,null,null,null,null,null,{"$f":"Chart!#REF!","v":{"$error":"#REF!"}},{"$f":"Chart!#REF!","v":{"$error":"#REF!"}},{"$f":"Chart!#REF!","v":{"$error":"#REF!"}},{"$f":"Chart!#REF!","v":{"$error":"#REF!"}}]
[null,null,null,null,null,null,null,null,null,null,null,null,null,null,null,null,null,null,null,null,{"$f":"Chart!#REF!","v":{"$error":"#REF!"}},{"$f":"Chart!#REF!","v":{"$error":"#REF!"}},{"$f":"Chart!#REF!","v":{"$error":"#REF!"}},{"$f":"Chart!#REF!","v":{"$error":"#REF!"}}]
[null,null,null,null,null,null,null,null,null,null,null,null,null,null,null,null,null,null,null,null,{"$f":"Chart!#REF!","v":{"$error":"#REF!"}},{"$f":"Chart!#REF!","v":{"$error":"#REF!"}},{"$f":"Chart!#REF!","v":{"$error":"#REF!"}},{"$f":"Chart!#REF!","v":{"$error":"#REF!"}}]
[null,null,null,null,null,null,null,null,null,null,null,null,null,null,null,null,null,null,null,null,{"$f":"Chart!#REF!","v":{"$error":"#REF!"}},{"$f":"Chart!#REF!","v":{"$error":"#REF!"}},{"$f":"Chart!#REF!","v":{"$error":"#REF!"}},{"$f":"Chart!#REF!","v":{"$error":"#REF!"}}]
[null,null,null,null,null,null,null,null,null,null,null,null,null,null,null,null,null,null,null,null,{"$f":"Chart!#REF!","v":{"$error":"#REF!"}},{"$f":"Chart!#REF!","v":{"$error":"#REF!"}},{"$f":"Chart!#REF!","v":{"$error":"#REF!"}},{"$f":"Chart!#REF!","v":{"$error":"#REF!"}}]
[null,null,null,null,null,null,null,null,null,null,null,null,null,null,null,null,null,null,null,null,{"$f":"Chart!#REF!","v":{"$error":"#REF!"}},{"$f":"Chart!#REF!","v":{"$error":"#REF!"}},{"$f":"Chart!#REF!","v":{"$error":"#REF!"}},{"$f":"Chart!#REF!","v":{"$error":"#REF!"}}]
[null,null,null,null,null,null,null,null,null,null,null,null,null,null,null,null,null,null,null,null,{"$f":"Chart!#REF!","v":{"$error":"#REF!"}},{"$f":"Chart!#REF!","v":{"$error":"#REF!"}},{"$f":"Chart!#REF!","v":{"$error":"#REF!"}},{"$f":"Chart!#REF!","v":{"$error":"#REF!"}}]
[null,null,null,null,null,null,null,null,null,null,null,null,null,null,null,null,null,null,null,null,{"$f":"Chart!#REF!","v":{"$error":"#REF!"}},{"$f":"Chart!#REF!","v":{"$error":"#REF!"}},{"$f":"Chart!#REF!","v":{"$error":"#REF!"}},{"$f":"Chart!#REF!","v":{"$error":"#REF!"}}]
[null,null,null,null,null,null,null,null,null,null,null,null,null,null,null,null,null,null,null,null,{"$f":"Chart!#REF!","v":{"$error":"#REF!"}},{"$f":"Chart!#REF!","v":{"$error":"#REF!"}},{"$f":"Chart!#REF!","v":{"$error":"#REF!"}},{"$f":"Chart!#REF!","v":{"$error":"#REF!"}}]
[null,null,null,null,null,null,null,null,null,null,null,null,null,null,null,null,null,null,null,null,{"$f":"Chart!#REF!","v":{"$error":"#REF!"}},{"$f":"Chart!#REF!","v":{"$error":"#REF!"}},{"$f":"Chart!#REF!","v":{"$error":"#REF!"}},{"$f":"Chart!#REF!","v":{"$error":"#REF!"}}]
[null,null,null,null,null,null,null,null,null,null,null,null,null,null,null,null,null,null,null,null,{"$f":"Chart!#REF!","v":{"$error":"#REF!"}},{"$f":"Chart!#REF!","v":{"$error":"#REF!"}},{"$f":"Chart!#REF!","v":{"$error":"#REF!"}},{"$f":"Chart!#REF!","v":{"$error":"#REF!"}}]
[null,null,null,null,null,null,null,null,null,null,null,null,null,null,null,null,null,null,null,null,{"$f":"Chart!#REF!","v":{"$error":"#REF!"}},{"$f":"Chart!#REF!","v":{"$error":"#REF!"}},{"$f":"Chart!#REF!","v":{"$error":"#REF!"}},{"$f":"Chart!#REF!","v":{"$error":"#REF!"}}]
[null,null,null,null,null,null,null,null,null,null,null,null,null,null,null,null,null,null,null,null,{"$f":"Chart!#REF!","v":{"$error":"#REF!"}},{"$f":"Chart!#REF!","v":{"$error":"#REF!"}},{"$f":"Chart!#REF!","v":{"$error":"#REF!"}},{"$f":"Chart!#REF!","v":{"$error":"#REF!"}}]
[null,null,null,null,null,null,null,null,null,null,null,null,null,null,null,null,null,null,null,null,{"$f":"Chart!#REF!","v":{"$error":"#REF!"}},{"$f":"Chart!#REF!","v":{"$error":"#REF!"}},{"$f":"Chart!#REF!","v":{"$error":"#REF!"}},{"$f":"Chart!#REF!","v":{"$error":"#REF!"}}]
[null,null,null,null,null,null,null,null,null,null,null,null,null,null,null,null,null,null,null,null,{"$f":"Chart!#REF!","v":{"$error":"#REF!"}},{"$f":"Chart!#REF!","v":{"$error":"#REF!"}},{"$f":"Chart!#REF!","v":{"$error":"#REF!"}},{"$f":"Chart!#REF!","v":{"$error":"#REF!"}}]
[null,null,null,null,null,null,null,null,null,null,null,null,null,null,null,null,null,null,null,null,{"$f":"Chart!#REF!","v":{"$error":"#REF!"}},{"$f":"Chart!#REF!","v":{"$error":"#REF!"}},{"$f":"Chart!#REF!","v":{"$error":"#REF!"}},{"$f":"Chart!#REF!","v":{"$error":"#REF!"}}]
[null,null,null,null,null,null,null,null,null,null,null,null,null,null,null,null,null,null,null,null,{"$f":"Chart!#REF!","v":{"$error":"#REF!"}},{"$f":"Chart!#REF!","v":{"$error":"#REF!"}},{"$f":"Chart!#REF!","v":{"$error":"#REF!"}},{"$f":"Chart!#REF!","v":{"$error":"#REF!"}}]
[null,null,null,null,null,null,null,null,null,null,null,null,null,null,null,null,null,null,null,null,{"$f":"Chart!#REF!","v":{"$error":"#REF!"}},{"$f":"Chart!#REF!","v":{"$error":"#REF!"}},{"$f":"Chart!#REF!","v":{"$error":"#REF!"}},{"$f":"Chart!#REF!","v":{"$error":"#REF!"}}]
[null,null,null,null,null,null,null,null,null,null,null,null,null,null,null,null,null,null,null,null,{"$f":"Chart!#REF!","v":{"$error":"#REF!"}},{"$f":"Chart!#REF!","v":{"$error":"#REF!"}},{"$f":"Chart!#REF!","v":{"$error":"#REF!"}},{"$f":"Chart!#REF!","v":{"$error":"#REF!"}}]
[null,null,null,null,null,null,null,null,null,null,null,null,null,null,null,null,null,null,null,null,{"$f":"Chart!#REF!","v":{"$error":"#REF!"}},{"$f":"Chart!#REF!","v":{"$error":"#REF!"}},{"$f":"Chart!#REF!","v":{"$error":"#REF!"}},{"$f":"Chart!#REF!","v":{"$error":"#REF!"}}]
[null,null,null,null,null,null,null,null,null,null,null,null,null,null,null,null,null,null,null,null,{"$f":"Chart!#REF!","v":{"$error":"#REF!"}},{"$f":"Chart!#REF!","v":{"$error":"#REF!"}},{"$f":"Chart!#REF!","v":{"$error":"#REF!"}},{"$f":"Chart!#REF!","v":{"$error":"#REF!"}}]
[null,null,null,null,null,null,null,null,null,null,null,null,null,null,null,null,null,null,null,null,{"$f":"Chart!#REF!","v":{"$error":"#REF!"}},{"$f":"Chart!#REF!","v":{"$error":"#REF!"}},{"$f":"Chart!#REF!","v":{"$error":"#REF!"}},{"$f":"Chart!#REF!","v":{"$error":"#REF!"}}]
[null,null,null,null,null,null,null,null,null,null,null,null,null,null,null,null,null,null,null,null,{"$f":"Chart!#REF!","v":{"$error":"#REF!"}},{"$f":"Chart!#REF!","v":{"$error":"#REF!"}},{"$f":"Chart!#REF!","v":{"$error":"#REF!"}},{"$f":"Chart!#REF!","v":{"$error":"#REF!"}}]
[null,null,null,null,null,null,null,null,null,null,null,null,null,null,null,null,null,null,null,null,{"$f":"Chart!#REF!","v":{"$error":"#REF!"}},{"$f":"Chart!#REF!","v":{"$error":"#REF!"}},{"$f":"Chart!#REF!","v":{"$error":"#REF!"}},{"$f":"Chart!#REF!","v":{"$error":"#REF!"}}]
[null,null,null,null,null,null,null,null,null,null,null,null,null,null,null,null,null,null,null,null,{"$f":"Chart!#REF!","v":{"$error":"#REF!"}},{"$f":"Chart!#REF!","v":{"$error":"#REF!"}},{"$f":"Chart!#REF!","v":{"$error":"#REF!"}},{"$f":"Chart!#REF!","v":{"$error":"#REF!"}}]
[null,null,null,null,null,null,null,null,null,null,null,null,null,null,null,null,null,null,null,null,{"$f":"Chart!#REF!","v":{"$error":"#REF!"}},{"$f":"Chart!#REF!","v":{"$error":"#REF!"}},{"$f":"Chart!#REF!","v":{"$error":"#REF!"}},{"$f":"Chart!#REF!","v":{"$error":"#REF!"}}]
[null,null,null,null,null,null,null,null,null,null,null,null,null,null,null,null,null,null,null,null,{"$f":"Chart!#REF!","v":{"$error":"#REF!"}},{"$f":"Chart!#REF!","v":{"$error":"#REF!"}},{"$f":"Chart!#REF!","v":{"$error":"#REF!"}},{"$f":"Chart!#REF!","v":{"$error":"#REF!"}}]
[null,null,null,null,null,null,null,null,null,null,null,null,null,null,null,null,null,null,null,null,{"$f":"Chart!#REF!","v":{"$error":"#REF!"}},{"$f":"Chart!#REF!","v":{"$error":"#REF!"}},{"$f":"Chart!#REF!","v":{"$error":"#REF!"}},{"$f":"Chart!#REF!","v":{"$error":"#REF!"}}]
[null,null,null,null,null,null,null,null,null,null,null,null,null,null,null,null,null,null,null,null,{"$f":"Chart!#REF!","v":{"$error":"#REF!"}},{"$f":"Chart!#REF!","v":{"$error":"#REF!"}},{"$f":"Chart!#REF!","v":{"$error":"#REF!"}},{"$f":"Chart!#REF!","v":{"$error":"#REF!"}}]
[null,null,null,null,null,null,null,null,null,null,null,null,null,null,null,null,null,null,null,null,{"$f":"Chart!#REF!","v":{"$error":"#REF!"}},{"$f":"Chart!#REF!","v":{"$error":"#REF!"}},{"$f":"Chart!#REF!","v":{"$error":"#REF!"}},{"$f":"Chart!#REF!","v":{"$error":"#REF!"}}]
[null,null,null,null,null,null,null,null,null,null,null,null,null,null,null,null,null,null,null,null,{"$f":"Chart!#REF!","v":{"$error":"#REF!"}},{"$f":"Chart!#REF!","v":{"$error":"#REF!"}},{"$f":"Chart!#REF!","v":{"$error":"#REF!"}},{"$f":"Chart!#REF!","v":{"$error":"#REF!"}}]
[null,null,null,null,null,null,null,null,null,null,null,null,null,null,null,null,null,null,null,null,{"$f":"Chart!#REF!","v":{"$error":"#REF!"}},{"$f":"Chart!#REF!","v":{"$error":"#REF!"}},{"$f":"Chart!#REF!","v":{"$error":"#REF!"}},{"$f":"Chart!#REF!","v":{"$error":"#REF!"}}]
[null,null,null,null,null,null,null,null,null,null,null,null,null,null,null,null,null,null,null,null,{"$f":"Chart!#REF!","v":{"$error":"#REF!"}},{"$f":"Chart!#REF!","v":{"$error":"#REF!"}},{"$f":"Chart!#REF!","v":{"$error":"#REF!"}},{"$f":"Chart!#REF!","v":{"$error":"#REF!"}}]
[null,null,null,null,null,null,null,null,null,null,null,null,null,null,null,null,null,null,null,null,{"$f":"Chart!#REF!","v":{"$error":"#REF!"}},{"$f":"Chart!#REF!","v":{"$error":"#REF!"}},{"$f":"Chart!#REF!","v":{"$error":"#REF!"}},{"$f":"Chart!#REF!","v":{"$error":"#REF!"}}]
[null,null,null,null,null,null,null,null,null,null,null,null,null,null,null,null,null,null,null,null,{"$f":"Chart!#REF!","v":{"$error":"#REF!"}},{"$f":"Chart!#REF!","v":{"$error":"#REF!"}},{"$f":"Chart!#REF!","v":{"$error":"#REF!"}},{"$f":"Chart!#REF!","v":{"$error":"#REF!"}}]
[null,null,null,null,null,null,null,null,null,null,null,null,null,null,null,null,null,null,null,null,{"$f":"Chart!#REF!","v":{"$error":"#REF!"}},{"$f":"Chart!#REF!","v":{"$error":"#REF!"}},{"$f":"Chart!#REF!","v":{"$error":"#REF!"}},{"$f":"Chart!#REF!","v":{"$error":"#REF!"}}]
[null,null,null,null,null,null,null,null,null,null,null,null,null,null,null,null,null,null,null,null,{"$f":"Chart!#REF!","v":{"$error":"#REF!"}},{"$f":"Chart!#REF!","v":{"$error":"#REF!"}},{"$f":"Chart!#REF!","v":{"$error":"#REF!"}},{"$f":"Chart!#REF!","v":{"$error":"#REF!"}}]
[null,null,null,null,null,null,null,null,null,null,null,null,null,null,null,null,null,null,null,null,{"$f":"Chart!#REF!","v":{"$error":"#REF!"}},{"$f":"Chart!#REF!","v":{"$error":"#REF!"}},{"$f":"Chart!#REF!","v":{"$error":"#REF!"}},{"$f":"Chart!#REF!","v":{"$error":"#REF!"}}]
[null,null,null,null,null,null,null,null,null,null,null,null,null,null,null,null,null,null,null,null,{"$f":"Chart!#REF!","v":{"$error":"#REF!"}},{"$f":"Chart!#REF!","v":{"$error":"#REF!"}},{"$f":"Chart!#REF!","v":{"$error":"#REF!"}},{"$f":"Chart!#REF!","v":{"$error":"#REF!"}}]
[null,null,null,null,null,null,null,null,null,null,null,null,null,null,null,null,null,null,null,null,{"$f":"Chart!#REF!","v":{"$error":"#REF!"}},{"$f":"Chart!#REF!","v":{"$error":"#REF!"}},{"$f":"Chart!#REF!","v":{"$error":"#REF!"}},{"$f":"Chart!#REF!","v":{"$error":"#REF!"}}]
[null,null,null,null,null,null,null,null,null,null,null,null,null,null,null,null,null,null,null,null,{"$f":"Chart!#REF!","v":{"$error":"#REF!"}},{"$f":"Chart!#REF!","v":{"$error":"#REF!"}},{"$f":"Chart!#REF!","v":{"$error":"#REF!"}},{"$f":"Chart!#REF!","v":{"$error":"#REF!"}}]
[null,null,null,null,null,null,null,null,null,null,null,null,null,null,null,null,null,null,null,null,{"$f":"Chart!#REF!","v":{"$error":"#REF!"}},{"$f":"Chart!#REF!","v":{"$error":"#REF!"}},{"$f":"Chart!#REF!","v":{"$error":"#REF!"}},{"$f":"Chart!#REF!","v":{"$error":"#REF!"}}]
[null,null,null,null,null,null,null,null,null,null,null,null,null,null,null,null,null,null,null,null,{"$f":"Chart!#REF!","v":{"$error":"#REF!"}},{"$f":"Chart!#REF!","v":{"$error":"#REF!"}},{"$f":"Chart!#REF!","v":{"$error":"#REF!"}},{"$f":"Chart!#REF!","v":{"$error":"#REF!"}}]
[null,null,null,null,null,null,null,null,null,null,null,null,null,null,null,null,null,null,null,null,{"$f":"Chart!#REF!","v":{"$error":"#REF!"}},{"$f":"Chart!#REF!","v":{"$error":"#REF!"}},{"$f":"Chart!#REF!","v":{"$error":"#REF!"}},{"$f":"Chart!#REF!","v":{"$error":"#REF!"}}]
[null,null,null,null,null,null,null,null,null,null,null,null,null,null,null,null,null,null,null,null,{"$f":"Chart!#REF!","v":{"$error":"#REF!"}},{"$f":"Chart!#REF!","v":{"$error":"#REF!"}},{"$f":"Chart!#REF!","v":{"$error":"#REF!"}},{"$f":"Chart!#REF!","v":{"$error":"#REF!"}}]
[null,null,null,null,null,null,null,null,null,null,null,null,null,null,null,null,null,null,null,null,{"$f":"Chart!#REF!","v":{"$error":"#REF!"}},{"$f":"Chart!#REF!","v":{"$error":"#REF!"}},{"$f":"Chart!#REF!","v":{"$error":"#REF!"}},{"$f":"Chart!#REF!","v":{"$error":"#REF!"}}]
[null,null,null,null,null,null,null,null,null,null,null,null,null,null,null,null,null,null,null,null,{"$f":"Chart!#REF!","v":{"$error":"#REF!"}},{"$f":"Chart!#REF!","v":{"$error":"#REF!"}},{"$f":"Chart!#REF!","v":{"$error":"#REF!"}},{"$f":"Chart!#REF!","v":{"$error":"#REF!"}}]
[null,null,null,null,null,null,null,null,null,null,null,null,null,null,null,null,null,null,null,null,{"$f":"Chart!#REF!","v":{"$error":"#REF!"}},{"$f":"Chart!#REF!","v":{"$error":"#REF!"}},{"$f":"Chart!#REF!","v":{"$error":"#REF!"}},{"$f":"Chart!#REF!","v":{"$error":"#REF!"}}]
[null,null,null,null,null,null,null,null,null,null,null,null,null,null,null,null,null,null,null,null,{"$f":"Chart!#REF!","v":{"$error":"#REF!"}},{"$f":"Chart!#REF!","v":{"$error":"#REF!"}},{"$f":"Chart!#REF!","v":{"$error":"#REF!"}},{"$f":"Chart!#REF!","v":{"$error":"#REF!"}}]
[null,null,null,null,null,null,null,null,null,null,null,null,null,null,null,null,null,null,null,null,{"$f":"Chart!#REF!","v":{"$error":"#REF!"}},{"$f":"Chart!#REF!","v":{"$error":"#REF!"}},{"$f":"Chart!#REF!","v":{"$error":"#REF!"}},{"$f":"Chart!#REF!","v":{"$error":"#REF!"}}]
[null,null,null,null,null,null,null,null,null,null,null,null,null,null,null,null,null,null,null,null,{"$f":"Chart!#REF!","v":{"$error":"#REF!"}},{"$f":"Chart!#REF!","v":{"$error":"#REF!"}},{"$f":"Chart!#REF!","v":{"$error":"#REF!"}},{"$f":"Chart!#REF!","v":{"$error":"#REF!"}}]
[null,null,null,null,null,null,null,null,null,null,null,null,null,null,null,null,null,null,null,null,{"$f":"Chart!#REF!","v":{"$error":"#REF!"}},{"$f":"Chart!#REF!","v":{"$error":"#REF!"}},{"$f":"Chart!#REF!","v":{"$error":"#REF!"}},{"$f":"Chart!#REF!","v":{"$error":"#REF!"}}]
[null,null,null,null,null,null,null,null,null,null,null,null,null,null,null,null,null,null,null,null,{"$f":"Chart!#REF!","v":{"$error":"#REF!"}},{"$f":"Chart!#REF!","v":{"$error":"#REF!"}},{"$f":"Chart!#REF!","v":{"$error":"#REF!"}},{"$f":"Chart!#REF!","v":{"$error":"#REF!"}}]
[null,null,null,null,null,null,null,null,null,null,null,null,null,null,null,null,null,null,null,null,{"$f":"Chart!#REF!","v":{"$error":"#REF!"}},{"$f":"Chart!#REF!","v":{"$error":"#REF!"}},{"$f":"Chart!#REF!","v":{"$error":"#REF!"}},{"$f":"Chart!#REF!","v":{"$error":"#REF!"}}]

{"sheet":"Semi Final","index":6,"n_rows":133,"n_cols":24,"rows_kept":133,"cut":false,"hidden":false,"merged":[[0,1,0,7],[1,1,1,7],[2,1,2,7],[3,1,3,7],[13,1,14,1],[17,1,18,1],[19,1,20,1],[5,1,6,1],[7,1,8,1],[9,1,10,1],[11,1,12,1],[15,1,16,1],[29,1,30,1],[31,1,32,1],[33,1,34,1],[35,1,36,1],[21,1,22,1],[23,1,24,1],[25,1,26,1],[27,1,28,1],[45,1,46,1],[47,1,48,1],[49,1,50,1],[51,1,52,1],[37,1,38,1],[39,1,40,1],[41,1,42,1],[43,1,44,1],[61,1,62,1],[63,1,64,1],[65,1,66,1],[67,1,68,1],[53,1,54,1],[55,1,56,1],[57,1,58,1],[59,1,60,1]]}
[null,{"$f":"Chart!$A$1","v":"BOWRAL BOWLS MIXED PAIRS 2022 10AM START"}]
[null,"Men's Pairs - Semi Finals"]
[null,"2013-07-06"]
[null,"Roll up at 12.40pm for 1.00pm Start"]
[null,"Match No.",null,null,"Match No."]
[null,1,{"$f":"VLOOKUP($H6,U6:X133,4,FALSE)","v":{"$error":"#N/A"}},{"$f":"VLOOKUP($H6,U6:X133,3,FALSE)","v":{"$error":"#N/A"}},null,{"$f":"VLOOKUP($H6,U6:X133,2,FALSE)","v":{"$error":"#N/A"}},{"$f":"Chart!$B$8","v":"A. MOORE"},{"$f":"Chart!$I$13","v":""},null,null,null,null,null,null,null,null,null,null,null,null,{"$f":"Chart!$E$8","v":"T. BUTT"},{"$f":"Chart!$D$8","v":0},{"$f":"Chart!$C$8","v":0},{"$f":"Chart!$B$8","v":"A. MOORE"}]
[null,null,{"$f":"VLOOKUP($H7,U7:X134,4,FALSE)","v":{"$error":"#N/A"}},{"$f":"VLOOKUP($H7,U7:X134,3,FALSE)","v":{"$error":"#N/A"}},null,{"$f":"VLOOKUP($H7,U7:X134,2,FALSE)","v":{"$error":"#N/A"}},null,{"$f":"Chart!$I$33","v":""},null,null,null,null,null,null,null,null,null,null,null,null,{"$f":"Chart!$E$12","v":"E. HALL"},{"$f":"Chart!$D$12","v":0},{"$f":"Chart!$C$12","v":0},{"$f":"Chart!$B$12","v":"B. CROWLEY"}]
[null,2,{"$f":"VLOOKUP($H8,U8:X135,4,FALSE)","v":{"$error":"#N/A"}},{"$f":"VLOOKUP($H8,U8:X135,3,FALSE)","v":{"$error":"#N/A"}},null,{"$f":"VLOOKUP($H8,U8:X135,2,FALSE)","v":{"$error":"#N/A"}},null,{"$f":"Chart!$I$53","v":""},null,null,null,null,null,null,null,null,null,null,null,null,{"$f":"Chart!$E$18","v":"Bye"},{"$f":"Chart!$D$18","v":0},{"$f":"Chart!$C$18","v":0},{"$f":"Chart!$B$18","v":0}]
[null,7,{"$f":"VLOOKUP($H9,U9:X136,4,FALSE)","v":{"$error":"#N/A"}},{"$f":"VLOOKUP($H9,U9:X136,3,FALSE)","v":{"$error":"#N/A"}},null,{"$f":"VLOOKUP($H9,U9:X136,2,FALSE)","v":{"$error":"#N/A"}},null,{"$f":"Chart!$I$73","v":""},null,null,null,null,null,null,null,null,null,null,null,null,{"$f":"Chart!$E$22","v":"N. BOYERS"},{"$f":"Chart!$D$22","v":0},{"$f":"Chart!$C$22","v":0},{"$f":"Chart!$B$22","v":"R. SOUTH"}]
[null,null,null,null,null,null,null,null,null,null,null,null,null,null,null,null,null,null,null,null,{"$f":"Chart!$E$28","v":"B. PORTER"},{"$f":"Chart!$D$28","v":0},{"$f":"Chart!$C$28","v":0},{"$f":"Chart!$B$28","v":"L. BOSHIER"}]
[null,null,null,null,null,null,null,null,null,null,null,null,null,null,null,null,null,null,null,null,{"$f":"Chart!$E$32","v":"K.STAFFORD"},{"$f":"Chart!$D$32","v":0},{"$f":"Chart!$C$32","v":0},{"$f":"Chart!$B$32","v":"J. HAYDEN"}]
[null,null,null,null,null,null,null,null,null,null,null,null,null,null,null,null,null,null,null,null,{"$f":"Chart!$E$38","v":"Bye"},{"$f":"Chart!$D$38","v":0},{"$f":"Chart!$C$38","v":0},{"$f":"Chart!$B$38","v":0}]
[null,null,null,null,null,null,null,null,null,null,null,null,null,null,null,null,null,null,null,null,{"$f":"Chart!$E$42","v":"C. SPILKER"},{"$f":"Chart!$D$42","v":0},{"$f":"Chart!$C$42","v":0},{"$f":"Chart!$B$42","v":"A. LAMB"}]
[null,null,null,null,null,null,null,null,null,null,null,null,null,null,null,null,null,null,null,null,{"$f":"Chart!$E$48","v":"G. FRASER"},{"$f":"Chart!$D$48","v":0},{"$f":"Chart!$C$48","v":0},{"$f":"Chart!$B$48","v":"J. NEELY"}]
[null,null,null,null,null,null,null,null,null,null,null,null,null,null,null,null,null,null,null,null,{"$f":"Chart!$E$52","v":"B. EDWARDS"},{"$f":"Chart!$D$52","v":0},{"$f":"Chart!$C$52","v":0},{"$f":"Chart!$B$52","v":"E. JONES"}]
[null,null,null,null,null,null,null,null,null,null,null,null,null,null,null,null,null,null,null,null,{"$f":"Chart!$E$58","v":"Bye"},{"$f":"Chart!$D$58","v":0},{"$f":"Chart!$C$58","v":0},{"$f":"Chart!$B$58","v":0}]
[null,null,null,null,null,null,null,null,null,null,null,null,null,null,null,null,null,null,null,null,{"$f":"Chart!$E$62","v":"B. CLAYTON"},{"$f":"Chart!$D$62","v":0},{"$f":"Chart!$C$62","v":0},{"$f":"Chart!$B$62","v":"A CONNOR"}]
[null,null,null,null,null,null,null,null,null,null,null,null,null,null,null,null,null,null,null,null,{"$f":"Chart!$E$68","v":"Bye"},{"$f":"Chart!$D$68","v":0},{"$f":"Chart!$C$68","v":0},{"$f":"Chart!$B$68","v":0}]
[null,null,null,null,null,null,null,null,null,null,null,null,null,null,null,null,null,null,null,null,{"$f":"Chart!$E$72","v":"E. BROWN"},{"$f":"Chart!$D$72","v":0},{"$f":"Chart!$C$72","v":0},{"$f":"Chart!$B$72","v":"D. COLEMAN"}]
[null,null,null,null,null,null,null,null,null,null,null,null,null,null,null,null,null,null,null,null,{"$f":"Chart!$E$78","v":"Bye"},{"$f":"Chart!$D$78","v":0},{"$f":"Chart!$C$78","v":0},{"$f":"Chart!$B$78","v":0}]
[null,null,null,null,null,null,null,null,null,null,null,null,null,null,null,null,null,null,null,null,{"$f":"Chart!$E$82","v":"A. McGHEE"},{"$f":"Chart!$D$82","v":0},{"$f":"Chart!$C$82","v":0},{"$f":"Chart!$B$82","v":"E. SHEPHERD"}]
[null,null,null,null,null,null,null,null,null,null,null,null,null,null,null,null,null,null,null,null,{"$f":"Chart!#REF!","v":{"$error":"#REF!"}},{"$f":"Chart!#REF!","v":{"$error":"#REF!"}},{"$f":"Chart!#REF!","v":{"$error":"#REF!"}},{"$f":"Chart!#REF!","v":{"$error":"#REF!"}}]
[null,null,null,null,null,null,null,null,null,null,null,null,null,null,null,null,null,null,null,null,{"$f":"Chart!#REF!","v":{"$error":"#REF!"}},{"$f":"Chart!#REF!","v":{"$error":"#REF!"}},{"$f":"Chart!#REF!","v":{"$error":"#REF!"}},{"$f":"Chart!#REF!","v":{"$error":"#REF!"}}]
[null,null,null,null,null,null,null,null,null,null,null,null,null,null,null,null,null,null,null,null,{"$f":"Chart!#REF!","v":{"$error":"#REF!"}},{"$f":"Chart!#REF!","v":{"$error":"#REF!"}},{"$f":"Chart!#REF!","v":{"$error":"#REF!"}},{"$f":"Chart!#REF!","v":{"$error":"#REF!"}}]
[null,null,null,null,null,null,null,null,null,null,null,null,null,null,null,null,null,null,null,null,{"$f":"Chart!#REF!","v":{"$error":"#REF!"}},{"$f":"Chart!#REF!","v":{"$error":"#REF!"}},{"$f":"Chart!#REF!","v":{"$error":"#REF!"}},{"$f":"Chart!#REF!","v":{"$error":"#REF!"}}]
[null,null,null,null,null,null,null,null,null,null,null,null,null,null,null,null,null,null,null,null,{"$f":"Chart!#REF!","v":{"$error":"#REF!"}},{"$f":"Chart!#REF!","v":{"$error":"#REF!"}},{"$f":"Chart!#REF!","v":{"$error":"#REF!"}},{"$f":"Chart!#REF!","v":{"$error":"#REF!"}}]
[null,null,null,null,null,null,null,null,null,null,null,null,null,null,null,null,null,null,null,null,{"$f":"Chart!#REF!","v":{"$error":"#REF!"}},{"$f":"Chart!#REF!","v":{"$error":"#REF!"}},{"$f":"Chart!#REF!","v":{"$error":"#REF!"}},{"$f":"Chart!#REF!","v":{"$error":"#REF!"}}]
[null,null,null,null,null,null,null,null,null,null,null,null,null,null,null,null,null,null,null,null,{"$f":"Chart!#REF!","v":{"$error":"#REF!"}},{"$f":"Chart!#REF!","v":{"$error":"#REF!"}},{"$f":"Chart!#REF!","v":{"$error":"#REF!"}},{"$f":"Chart!#REF!","v":{"$error":"#REF!"}}]
[null,null,null,null,null,null,null,null,null,null,null,null,null,null,null,null,null,null,null,null,{"$f":"Chart!#REF!","v":{"$error":"#REF!"}},{"$f":"Chart!#REF!","v":{"$error":"#REF!"}},{"$f":"Chart!#REF!","v":{"$error":"#REF!"}},{"$f":"Chart!#REF!","v":{"$error":"#REF!"}}]
[null,null,null,null,null,null,null,null,null,null,null,null,null,null,null,null,null,null,null,null,{"$f":"Chart!#REF!","v":{"$error":"#REF!"}},{"$f":"Chart!#REF!","v":{"$error":"#REF!"}},{"$f":"Chart!#REF!","v":{"$error":"#REF!"}},{"$f":"Chart!#REF!","v":{"$error":"#REF!"}}]
[null,null,null,null,null,null,null,null,null,null,null,null,null,null,null,null,null,null,null,null,{"$f":"Chart!#REF!","v":{"$error":"#REF!"}},{"$f":"Chart!#REF!","v":{"$error":"#REF!"}},{"$f":"Chart!#REF!","v":{"$error":"#REF!"}},{"$f":"Chart!#REF!","v":{"$error":"#REF!"}}]
[null,null,null,null,null,null,null,null,null,null,null,null,null,null,null,null,null,null,null,null,{"$f":"Chart!#REF!","v":{"$error":"#REF!"}},{"$f":"Chart!#REF!","v":{"$error":"#REF!"}},{"$f":"Chart!#REF!","v":{"$error":"#REF!"}},{"$f":"Chart!#REF!","v":{"$error":"#REF!"}}]
[null,null,null,null,null,null,null,null,null,null,null,null,null,null,null,null,null,null,null,null,{"$f":"Chart!#REF!","v":{"$error":"#REF!"}},{"$f":"Chart!#REF!","v":{"$error":"#REF!"}},{"$f":"Chart!#REF!","v":{"$error":"#REF!"}},{"$f":"Chart!#REF!","v":{"$error":"#REF!"}}]
[null,null,null,null,null,null,null,null,null,null,null,null,null,null,null,null,null,null,null,null,{"$f":"Chart!#REF!","v":{"$error":"#REF!"}},{"$f":"Chart!#REF!","v":{"$error":"#REF!"}},{"$f":"Chart!#REF!","v":{"$error":"#REF!"}},{"$f":"Chart!#REF!","v":{"$error":"#REF!"}}]
[null,null,null,null,null,null,null,null,null,null,null,null,null,null,null,null,null,null,null,null,{"$f":"Chart!#REF!","v":{"$error":"#REF!"}},{"$f":"Chart!#REF!","v":{"$error":"#REF!"}},{"$f":"Chart!#REF!","v":{"$error":"#REF!"}},{"$f":"Chart!#REF!","v":{"$error":"#REF!"}}]
[null,null,null,null,null,null,null,null,null,null,null,null,null,null,null,null,null,null,null,null,{"$f":"Chart!#REF!","v":{"$error":"#REF!"}},{"$f":"Chart!#REF!","v":{"$error":"#REF!"}},{"$f":"Chart!#REF!","v":{"$error":"#REF!"}},{"$f":"Chart!#REF!","v":{"$error":"#REF!"}}]
[null,null,null,null,null,null,null,null,null,null,null,null,null,null,null,null,null,null,null,null,{"$f":"Chart!#REF!","v":{"$error":"#REF!"}},{"$f":"Chart!#REF!","v":{"$error":"#REF!"}},{"$f":"Chart!#REF!","v":{"$error":"#REF!"}},{"$f":"Chart!#REF!","v":{"$error":"#REF!"}}]
[null,null,null,null,null,null,null,null,null,null,null,null,null,null,null,null,null,null,null,null,{"$f":"Chart!#REF!","v":{"$error":"#REF!"}},{"$f":"Chart!#REF!","v":{"$error":"#REF!"}},{"$f":"Chart!#REF!","v":{"$error":"#REF!"}},{"$f":"Chart!#REF!","v":{"$error":"#REF!"}}]
[null,null,null,null,null,null,null,null,null,null,null,null,null,null,null,null,null,null,null,null,{"$f":"Chart!#REF!","v":{"$error":"#REF!"}},{"$f":"Chart!#REF!","v":{"$error":"#REF!"}},{"$f":"Chart!#REF!","v":{"$error":"#REF!"}},{"$f":"Chart!#REF!","v":{"$error":"#REF!"}}]
[null,null,null,null,null,null,null,null,null,null,null,null,null,null,null,null,null,null,null,null,{"$f":"Chart!#REF!","v":{"$error":"#REF!"}},{"$f":"Chart!#REF!","v":{"$error":"#REF!"}},{"$f":"Chart!#REF!","v":{"$error":"#REF!"}},{"$f":"Chart!#REF!","v":{"$error":"#REF!"}}]
[null,null,null,null,null,null,null,null,null,null,null,null,null,null,null,null,null,null,null,null,{"$f":"Chart!#REF!","v":{"$error":"#REF!"}},{"$f":"Chart!#REF!","v":{"$error":"#REF!"}},{"$f":"Chart!#REF!","v":{"$error":"#REF!"}},{"$f":"Chart!#REF!","v":{"$error":"#REF!"}}]
[null,null,null,null,null,null,null,null,null,null,null,null,null,null,null,null,null,null,null,null,{"$f":"Chart!#REF!","v":{"$error":"#REF!"}},{"$f":"Chart!#REF!","v":{"$error":"#REF!"}},{"$f":"Chart!#REF!","v":{"$error":"#REF!"}},{"$f":"Chart!#REF!","v":{"$error":"#REF!"}}]
[null,null,null,null,null,null,null,null,null,null,null,null,null,null,null,null,null,null,null,null,{"$f":"Chart!#REF!","v":{"$error":"#REF!"}},{"$f":"Chart!#REF!","v":{"$error":"#REF!"}},{"$f":"Chart!#REF!","v":{"$error":"#REF!"}},{"$f":"Chart!#REF!","v":{"$error":"#REF!"}}]
[null,null,null,null,null,null,null,null,null,null,null,null,null,null,null,null,null,null,null,null,{"$f":"Chart!#REF!","v":{"$error":"#REF!"}},{"$f":"Chart!#REF!","v":{"$error":"#REF!"}},{"$f":"Chart!#REF!","v":{"$error":"#REF!"}},{"$f":"Chart!#REF!","v":{"$error":"#REF!"}}]
[null,null,null,null,null,null,null,null,null,null,null,null,null,null,null,null,null,null,null,null,{"$f":"Chart!#REF!","v":{"$error":"#REF!"}},{"$f":"Chart!#REF!","v":{"$error":"#REF!"}},{"$f":"Chart!#REF!","v":{"$error":"#REF!"}},{"$f":"Chart!#REF!","v":{"$error":"#REF!"}}]
[null,null,null,null,null,null,null,null,null,null,null,null,null,null,null,null,null,null,null,null,{"$f":"Chart!#REF!","v":{"$error":"#REF!"}},{"$f":"Chart!#REF!","v":{"$error":"#REF!"}},{"$f":"Chart!#REF!","v":{"$error":"#REF!"}},{"$f":"Chart!#REF!","v":{"$error":"#REF!"}}]
[null,null,null,null,null,null,null,null,null,null,null,null,null,null,null,null,null,null,null,null,{"$f":"Chart!#REF!","v":{"$error":"#REF!"}},{"$f":"Chart!#REF!","v":{"$error":"#REF!"}},{"$f":"Chart!#REF!","v":{"$error":"#REF!"}},{"$f":"Chart!#REF!","v":{"$error":"#REF!"}}]
[null,null,null,null,null,null,null,null,null,null,null,null,null,null,null,null,null,null,null,null,{"$f":"Chart!#REF!","v":{"$error":"#REF!"}},{"$f":"Chart!#REF!","v":{"$error":"#REF!"}},{"$f":"Chart!#REF!","v":{"$error":"#REF!"}},{"$f":"Chart!#REF!","v":{"$error":"#REF!"}}]
[null,null,null,null,null,null,null,null,null,null,null,null,null,null,null,null,null,null,null,null,{"$f":"Chart!#REF!","v":{"$error":"#REF!"}},{"$f":"Chart!#REF!","v":{"$error":"#REF!"}},{"$f":"Chart!#REF!","v":{"$error":"#REF!"}},{"$f":"Chart!#REF!","v":{"$error":"#REF!"}}]
[null,null,null,null,null,null,null,null,null,null,null,null,null,null,null,null,null,null,null,null,{"$f":"Chart!#REF!","v":{"$error":"#REF!"}},{"$f":"Chart!#REF!","v":{"$error":"#REF!"}},{"$f":"Chart!#REF!","v":{"$error":"#REF!"}},{"$f":"Chart!#REF!","v":{"$error":"#REF!"}}]
[null,null,null,null,null,null,null,null,null,null,null,null,null,null,null,null,null,null,null,null,{"$f":"Chart!#REF!","v":{"$error":"#REF!"}},{"$f":"Chart!#REF!","v":{"$error":"#REF!"}},{"$f":"Chart!#REF!","v":{"$error":"#REF!"}},{"$f":"Chart!#REF!","v":{"$error":"#REF!"}}]
[null,null,null,null,null,null,null,null,null,null,null,null,null,null,null,null,null,null,null,null,{"$f":"Chart!#REF!","v":{"$error":"#REF!"}},{"$f":"Chart!#REF!","v":{"$error":"#REF!"}},{"$f":"Chart!#REF!","v":{"$error":"#REF!"}},{"$f":"Chart!#REF!","v":{"$error":"#REF!"}}]
[null,null,null,null,null,null,null,null,null,null,null,null,null,null,null,null,null,null,null,null,{"$f":"Chart!#REF!","v":{"$error":"#REF!"}},{"$f":"Chart!#REF!","v":{"$error":"#REF!"}},{"$f":"Chart!#REF!","v":{"$error":"#REF!"}},{"$f":"Chart!#REF!","v":{"$error":"#REF!"}}]
[null,null,null,null,null,null,null,null,null,null,null,null,null,null,null,null,null,null,null,null,{"$f":"Chart!#REF!","v":{"$error":"#REF!"}},{"$f":"Chart!#REF!","v":{"$error":"#REF!"}},{"$f":"Chart!#REF!","v":{"$error":"#REF!"}},{"$f":"Chart!#REF!","v":{"$error":"#REF!"}}]
[null,null,null,null,null,null,null,null,null,null,null,null,null,null,null,null,null,null,null,null,{"$f":"Chart!#REF!","v":{"$error":"#REF!"}},{"$f":"Chart!#REF!","v":{"$error":"#REF!"}},{"$f":"Chart!#REF!","v":{"$error":"#REF!"}},{"$f":"Chart!#REF!","v":{"$error":"#REF!"}}]
[null,null,null,null,null,null,null,null,null,null,null,null,null,null,null,null,null,null,null,null,{"$f":"Chart!#REF!","v":{"$error":"#REF!"}},{"$f":"Chart!#REF!","v":{"$error":"#REF!"}},{"$f":"Chart!#REF!","v":{"$error":"#REF!"}},{"$f":"Chart!#REF!","v":{"$error":"#REF!"}}]
[null,null,null,null,null,null,null,null,null,null,null,null,null,null,null,null,null,null,null,null,{"$f":"Chart!#REF!","v":{"$error":"#REF!"}},{"$f":"Chart!#REF!","v":{"$error":"#REF!"}},{"$f":"Chart!#REF!","v":{"$error":"#REF!"}},{"$f":"Chart!#REF!","v":{"$error":"#REF!"}}]
[null,null,null,null,null,null,null,null,null,null,null,null,null,null,null,null,null,null,null,null,{"$f":"Chart!#REF!","v":{"$error":"#REF!"}},{"$f":"Chart!#REF!","v":{"$error":"#REF!"}},{"$f":"Chart!#REF!","v":{"$error":"#REF!"}},{"$f":"Chart!#REF!","v":{"$error":"#REF!"}}]
[null,null,null,null,null,null,null,null,null,null,null,null,null,null,null,null,null,null,null,null,{"$f":"Chart!#REF!","v":{"$error":"#REF!"}},{"$f":"Chart!#REF!","v":{"$error":"#REF!"}},{"$f":"Chart!#REF!","v":{"$error":"#REF!"}},{"$f":"Chart!#REF!","v":{"$error":"#REF!"}}]
[null,null,null,null,null,null,null,null,null,null,null,null,null,null,null,null,null,null,null,null,{"$f":"Chart!#REF!","v":{"$error":"#REF!"}},{"$f":"Chart!#REF!","v":{"$error":"#REF!"}},{"$f":"Chart!#REF!","v":{"$error":"#REF!"}},{"$f":"Chart!#REF!","v":{"$error":"#REF!"}}]
[null,null,null,null,null,null,null,null,null,null,null,null,null,null,null,null,null,null,null,null,{"$f":"Chart!#REF!","v":{"$error":"#REF!"}},{"$f":"Chart!#REF!","v":{"$error":"#REF!"}},{"$f":"Chart!#REF!","v":{"$error":"#REF!"}},{"$f":"Chart!#REF!","v":{"$error":"#REF!"}}]
[null,null,null,null,null,null,null,null,null,null,null,null,null,null,null,null,null,null,null,null,{"$f":"Chart!#REF!","v":{"$error":"#REF!"}},{"$f":"Chart!#REF!","v":{"$error":"#REF!"}},{"$f":"Chart!#REF!","v":{"$error":"#REF!"}},{"$f":"Chart!#REF!","v":{"$error":"#REF!"}}]
[null,null,null,null,null,null,null,null,null,null,null,null,null,null,null,null,null,null,null,null,{"$f":"Chart!#REF!","v":{"$error":"#REF!"}},{"$f":"Chart!#REF!","v":{"$error":"#REF!"}},{"$f":"Chart!#REF!","v":{"$error":"#REF!"}},{"$f":"Chart!#REF!","v":{"$error":"#REF!"}}]
[null,null,null,null,null,null,null,null,null,null,null,null,null,null,null,null,null,null,null,null,{"$f":"Chart!#REF!","v":{"$error":"#REF!"}},{"$f":"Chart!#REF!","v":{"$error":"#REF!"}},{"$f":"Chart!#REF!","v":{"$error":"#REF!"}},{"$f":"Chart!#REF!","v":{"$error":"#REF!"}}]
[null,null,null,null,null,null,null,null,null,null,null,null,null,null,null,null,null,null,null,null,{"$f":"Chart!#REF!","v":{"$error":"#REF!"}},{"$f":"Chart!#REF!","v":{"$error":"#REF!"}},{"$f":"Chart!#REF!","v":{"$error":"#REF!"}},{"$f":"Chart!#REF!","v":{"$error":"#REF!"}}]
[null,null,null,null,null,null,null,null,null,null,null,null,null,null,null,null,null,null,null,null,{"$f":"Chart!#REF!","v":{"$error":"#REF!"}},{"$f":"Chart!#REF!","v":{"$error":"#REF!"}},{"$f":"Chart!#REF!","v":{"$error":"#REF!"}},{"$f":"Chart!#REF!","v":{"$error":"#REF!"}}]
[null,null,null,null,null,null,null,null,null,null,null,null,null,null,null,null,null,null,null,null,{"$f":"Chart!#REF!","v":{"$error":"#REF!"}},{"$f":"Chart!#REF!","v":{"$error":"#REF!"}},{"$f":"Chart!#REF!","v":{"$error":"#REF!"}},{"$f":"Chart!#REF!","v":{"$error":"#REF!"}}]
[null,null,null,null,null,null,null,null,null,null,null,null,null,null,null,null,null,null,null,null,{"$f":"Chart!#REF!","v":{"$error":"#REF!"}},{"$f":"Chart!#REF!","v":{"$error":"#REF!"}},{"$f":"Chart!#REF!","v":{"$error":"#REF!"}},{"$f":"Chart!#REF!","v":{"$error":"#REF!"}}]
[null,null,null,null,null,null,null,null,null,null,null,null,null,null,null,null,null,null,null,null,{"$f":"Chart!#REF!","v":{"$error":"#REF!"}},{"$f":"Chart!#REF!","v":{"$error":"#REF!"}},{"$f":"Chart!#REF!","v":{"$error":"#REF!"}},{"$f":"Chart!#REF!","v":{"$error":"#REF!"}}]
[null,null,null,null,null,null,null,null,null,null,null,null,null,null,null,null,null,null,null,null,{"$f":"Chart!#REF!","v":{"$error":"#REF!"}},{"$f":"Chart!#REF!","v":{"$error":"#REF!"}},{"$f":"Chart!#REF!","v":{"$error":"#REF!"}},{"$f":"Chart!#REF!","v":{"$error":"#REF!"}}]
[null,null,null,null,null,null,null,null,null,null,null,null,null,null,null,null,null,null,null,null,{"$f":"Chart!#REF!","v":{"$error":"#REF!"}},{"$f":"Chart!#REF!","v":{"$error":"#REF!"}},{"$f":"Chart!#REF!","v":{"$error":"#REF!"}},{"$f":"Chart!#REF!","v":{"$error":"#REF!"}}]
[null,null,null,null,null,null,null,null,null,null,null,null,null,null,null,null,null,null,null,null,{"$f":"Chart!#REF!","v":{"$error":"#REF!"}},{"$f":"Chart!#REF!","v":{"$error":"#REF!"}},{"$f":"Chart!#REF!","v":{"$error":"#REF!"}},{"$f":"Chart!#REF!","v":{"$error":"#REF!"}}]
[null,null,null,null,null,null,null,null,null,null,null,null,null,null,null,null,null,null,null,null,{"$f":"Chart!#REF!","v":{"$error":"#REF!"}},{"$f":"Chart!#REF!","v":{"$error":"#REF!"}},{"$f":"Chart!#REF!","v":{"$error":"#REF!"}},{"$f":"Chart!#REF!","v":{"$error":"#REF!"}}]
[null,null,null,null,null,null,null,null,null,null,null,null,null,null,null,null,null,null,null,null,{"$f":"Chart!#REF!","v":{"$error":"#REF!"}},{"$f":"Chart!#REF!","v":{"$error":"#REF!"}},{"$f":"Chart!#REF!","v":{"$error":"#REF!"}},{"$f":"Chart!#REF!","v":{"$error":"#REF!"}}]
[null,null,null,null,null,null,null,null,null,null,null,null,null,null,null,null,null,null,null,null,{"$f":"Chart!#REF!","v":{"$error":"#REF!"}},{"$f":"Chart!#REF!","v":{"$error":"#REF!"}},{"$f":"Chart!#REF!","v":{"$error":"#REF!"}},{"$f":"Chart!#REF!","v":{"$error":"#REF!"}}]
[null,null,null,null,null,null,null,null,null,null,null,null,null,null,null,null,null,null,null,null,{"$f":"Chart!#REF!","v":{"$error":"#REF!"}},{"$f":"Chart!#REF!","v":{"$error":"#REF!"}},{"$f":"Chart!#REF!","v":{"$error":"#REF!"}},{"$f":"Chart!#REF!","v":{"$error":"#REF!"}}]
[null,null,null,null,null,null,null,null,null,null,null,null,null,null,null,null,null,null,null,null,{"$f":"Chart!#REF!","v":{"$error":"#REF!"}},{"$f":"Chart!#REF!","v":{"$error":"#REF!"}},{"$f":"Chart!#REF!","v":{"$error":"#REF!"}},{"$f":"Chart!#REF!","v":{"$error":"#REF!"}}]
[null,null,null,null,null,null,null,null,null,null,null,null,null,null,null,null,null,null,null,null,{"$f":"Chart!#REF!","v":{"$error":"#REF!"}},{"$f":"Chart!#REF!","v":{"$error":"#REF!"}},{"$f":"Chart!#REF!","v":{"$error":"#REF!"}},{"$f":"Chart!#REF!","v":{"$error":"#REF!"}}]
[null,null,null,null,null,null,null,null,null,null,null,null,null,null,null,null,null,null,null,null,{"$f":"Chart!#REF!","v":{"$error":"#REF!"}},{"$f":"Chart!#REF!","v":{"$error":"#REF!"}},{"$f":"Chart!#REF!","v":{"$error":"#REF!"}},{"$f":"Chart!#REF!","v":{"$error":"#REF!"}}]
[null,null,null,null,null,null,null,null,null,null,null,null,null,null,null,null,null,null,null,null,{"$f":"Chart!#REF!","v":{"$error":"#REF!"}},{"$f":"Chart!#REF!","v":{"$error":"#REF!"}},{"$f":"Chart!#REF!","v":{"$error":"#REF!"}},{"$f":"Chart!#REF!","v":{"$error":"#REF!"}}]
[null,null,null,null,null,null,null,null,null,null,null,null,null,null,null,null,null,null,null,null,{"$f":"Chart!#REF!","v":{"$error":"#REF!"}},{"$f":"Chart!#REF!","v":{"$error":"#REF!"}},{"$f":"Chart!#REF!","v":{"$error":"#REF!"}},{"$f":"Chart!#REF!","v":{"$error":"#REF!"}}]
[null,null,null,null,null,null,null,null,null,null,null,null,null,null,null,null,null,null,null,null,{"$f":"Chart!#REF!","v":{"$error":"#REF!"}},{"$f":"Chart!#REF!","v":{"$error":"#REF!"}},{"$f":"Chart!#REF!","v":{"$error":"#REF!"}},{"$f":"Chart!#REF!","v":{"$error":"#REF!"}}]
[null,null,null,null,null,null,null,null,null,null,null,null,null,null,null,null,null,null,null,null,{"$f":"Chart!#REF!","v":{"$error":"#REF!"}},{"$f":"Chart!#REF!","v":{"$error":"#REF!"}},{"$f":"Chart!#REF!","v":{"$error":"#REF!"}},{"$f":"Chart!#REF!","v":{"$error":"#REF!"}}]
[null,null,null,null,null,null,null,null,null,null,null,null,null,null,null,null,null,null,null,null,{"$f":"Chart!#REF!","v":{"$error":"#REF!"}},{"$f":"Chart!#REF!","v":{"$error":"#REF!"}},{"$f":"Chart!#REF!","v":{"$error":"#REF!"}},{"$f":"Chart!#REF!","v":{"$error":"#REF!"}}]
[null,null,null,null,null,null,null,null,null,null,null,null,null,null,null,null,null,null,null,null,{"$f":"Chart!#REF!","v":{"$error":"#REF!"}},{"$f":"Chart!#REF!","v":{"$error":"#REF!"}},{"$f":"Chart!#REF!","v":{"$error":"#REF!"}},{"$f":"Chart!#REF!","v":{"$error":"#REF!"}}]
[null,null,null,null,null,null,null,null,null,null,null,null,null,null,null,null,null,null,null,null,{"$f":"Chart!#REF!","v":{"$error":"#REF!"}},{"$f":"Chart!#REF!","v":{"$error":"#REF!"}},{"$f":"Chart!#REF!","v":{"$error":"#REF!"}},{"$f":"Chart!#REF!","v":{"$error":"#REF!"}}]
[null,null,null,null,null,null,null,null,null,null,null,null,null,null,null,null,null,null,null,null,{"$f":"Chart!#REF!","v":{"$error":"#REF!"}},{"$f":"Chart!#REF!","v":{"$error":"#REF!"}},{"$f":"Chart!#REF!","v":{"$error":"#REF!"}},{"$f":"Chart!#REF!","v":{"$error":"#REF!"}}]
[null,null,null,null,null,null,null,null,null,null,null,null,null,null,null,null,null,null,null,null,{"$f":"Chart!#REF!","v":{"$error":"#REF!"}},{"$f":"Chart!#REF!","v":{"$error":"#REF!"}},{"$f":"Chart!#REF!","v":{"$error":"#REF!"}},{"$f":"Chart!#REF!","v":{"$error":"#REF!"}}]
[null,null,null,null,null,null,null,null,null,null,null,null,null,null,null,null,null,null,null,null,{"$f":"Chart!#REF!","v":{"$error":"#REF!"}},{"$f":"Chart!#REF!","v":{"$error":"#REF!"}},{"$f":"Chart!#REF!","v":{"$error":"#REF!"}},{"$f":"Chart!#REF!","v":{"$error":"#REF!"}}]
[null,null,null,null,null,null,null,null,null,null,null,null,null,null,null,null,null,null,null,null,{"$f":"Chart!#REF!","v":{"$error":"#REF!"}},{"$f":"Chart!#REF!","v":{"$error":"#REF!"}},{"$f":"Chart!#REF!","v":{"$error":"#REF!"}},{"$f":"Chart!#REF!","v":{"$error":"#REF!"}}]
[null,null,null,null,null,null,null,null,null,null,null,null,null,null,null,null,null,null,null,null,{"$f":"Chart!#REF!","v":{"$error":"#REF!"}},{"$f":"Chart!#REF!","v":{"$error":"#REF!"}},{"$f":"Chart!#REF!","v":{"$error":"#REF!"}},{"$f":"Chart!#REF!","v":{"$error":"#REF!"}}]
[null,null,null,null,null,null,null,null,null,null,null,null,null,null,null,null,null,null,null,null,{"$f":"Chart!#REF!","v":{"$error":"#REF!"}},{"$f":"Chart!#REF!","v":{"$error":"#REF!"}},{"$f":"Chart!#REF!","v":{"$error":"#REF!"}},{"$f":"Chart!#REF!","v":{"$error":"#REF!"}}]
[null,null,null,null,null,null,null,null,null,null,null,null,null,null,null,null,null,null,null,null,{"$f":"Chart!#REF!","v":{"$error":"#REF!"}},{"$f":"Chart!#REF!","v":{"$error":"#REF!"}},{"$f":"Chart!#REF!","v":{"$error":"#REF!"}},{"$f":"Chart!#REF!","v":{"$error":"#REF!"}}]
[null,null,null,null,null,null,null,null,null,null,null,null,null,null,null,null,null,null,null,null,{"$f":"Chart!#REF!","v":{"$error":"#REF!"}},{"$f":"Chart!#REF!","v":{"$error":"#REF!"}},{"$f":"Chart!#REF!","v":{"$error":"#REF!"}},{"$f":"Chart!#REF!","v":{"$error":"#REF!"}}]
[null,null,null,null,null,null,null,null,null,null,null,null,null,null,null,null,null,null,null,null,{"$f":"Chart!#REF!","v":{"$error":"#REF!"}},{"$f":"Chart!#REF!","v":{"$error":"#REF!"}},{"$f":"Chart!#REF!","v":{"$error":"#REF!"}},{"$f":"Chart!#REF!","v":{"$error":"#REF!"}}]
[null,null,null,null,null,null,null,null,null,null,null,null,null,null,null,null,null,null,null,null,{"$f":"Chart!#REF!","v":{"$error":"#REF!"}},{"$f":"Chart!#REF!","v":{"$error":"#REF!"}},{"$f":"Chart!#REF!","v":{"$error":"#REF!"}},{"$f":"Chart!#REF!","v":{"$error":"#REF!"}}]
[null,null,null,null,null,null,null,null,null,null,null,null,null,null,null,null,null,null,null,null,{"$f":"Chart!#REF!","v":{"$error":"#REF!"}},{"$f":"Chart!#REF!","v":{"$error":"#REF!"}},{"$f":"Chart!#REF!","v":{"$error":"#REF!"}},{"$f":"Chart!#REF!","v":{"$error":"#REF!"}}]
[null,null,null,null,null,null,null,null,null,null,null,null,null,null,null,null,null,null,null,null,{"$f":"Chart!#REF!","v":{"$error":"#REF!"}},{"$f":"Chart!#REF!","v":{"$error":"#REF!"}},{"$f":"Chart!#REF!","v":{"$error":"#REF!"}},{"$f":"Chart!#REF!","v":{"$error":"#REF!"}}]
[null,null,null,null,null,null,null,null,null,null,null,null,null,null,null,null,null,null,null,null,{"$f":"Chart!#REF!","v":{"$error":"#REF!"}},{"$f":"Chart!#REF!","v":{"$error":"#REF!"}},{"$f":"Chart!#REF!","v":{"$error":"#REF!"}},{"$f":"Chart!#REF!","v":{"$error":"#REF!"}}]
[null,null,null,null,null,null,null,null,null,null,null,null,null,null,null,null,null,null,null,null,{"$f":"Chart!#REF!","v":{"$error":"#REF!"}},{"$f":"Chart!#REF!","v":{"$error":"#REF!"}},{"$f":"Chart!#REF!","v":{"$error":"#REF!"}},{"$f":"Chart!#REF!","v":{"$error":"#REF!"}}]
[null,null,null,null,null,null,null,null,null,null,null,null,null,null,null,null,null,null,null,null,{"$f":"Chart!#REF!","v":{"$error":"#REF!"}},{"$f":"Chart!#REF!","v":{"$error":"#REF!"}},{"$f":"Chart!#REF!","v":{"$error":"#REF!"}},{"$f":"Chart!#REF!","v":{"$error":"#REF!"}}]
[null,null,null,null,null,null,null,null,null,null,null,null,null,null,null,null,null,null,null,null,{"$f":"Chart!#REF!","v":{"$error":"#REF!"}},{"$f":"Chart!#REF!","v":{"$error":"#REF!"}},{"$f":"Chart!#REF!","v":{"$error":"#REF!"}},{"$f":"Chart!#REF!","v":{"$error":"#REF!"}}]
[null,null,null,null,null,null,null,null,null,null,null,null,null,null,null,null,null,null,null,null,{"$f":"Chart!#REF!","v":{"$error":"#REF!"}},{"$f":"Chart!#REF!","v":{"$error":"#REF!"}},{"$f":"Chart!#REF!","v":{"$error":"#REF!"}},{"$f":"Chart!#REF!","v":{"$error":"#REF!"}}]
[null,null,null,null,null,null,null,null,null,null,null,null,null,null,null,null,null,null,null,null,{"$f":"Chart!#REF!","v":{"$error":"#REF!"}},{"$f":"Chart!#REF!","v":{"$error":"#REF!"}},{"$f":"Chart!#REF!","v":{"$error":"#REF!"}},{"$f":"Chart!#REF!","v":{"$error":"#REF!"}}]
[null,null,null,null,null,null,null,null,null,null,null,null,null,null,null,null,null,null,null,null,{"$f":"Chart!#REF!","v":{"$error":"#REF!"}},{"$f":"Chart!#REF!","v":{"$error":"#REF!"}},{"$f":"Chart!#REF!","v":{"$error":"#REF!"}},{"$f":"Chart!#REF!","v":{"$error":"#REF!"}}]
[null,null,null,null,null,null,null,null,null,null,null,null,null,null,null,null,null,null,null,null,{"$f":"Chart!#REF!","v":{"$error":"#REF!"}},{"$f":"Chart!#REF!","v":{"$error":"#REF!"}},{"$f":"Chart!#REF!","v":{"$error":"#REF!"}},{"$f":"Chart!#REF!","v":{"$error":"#REF!"}}]
[null,null,null,null,null,null,null,null,null,null,null,null,null,null,null,null,null,null,null,null,{"$f":"Chart!#REF!","v":{"$error":"#REF!"}},{"$f":"Chart!#REF!","v":{"$error":"#REF!"}},{"$f":"Chart!#REF!","v":{"$error":"#REF!"}},{"$f":"Chart!#REF!","v":{"$error":"#REF!"}}]
[null,null,null,null,null,null,null,null,null,null,null,null,null,null,null,null,null,null,null,null,{"$f":"Chart!#REF!","v":{"$error":"#REF!"}},{"$f":"Chart!#REF!","v":{"$error":"#REF!"}},{"$f":"Chart!#REF!","v":{"$error":"#REF!"}},{"$f":"Chart!#REF!","v":{"$error":"#REF!"}}]
[null,null,null,null,null,null,null,null,null,null,null,null,null,null,null,null,null,null,null,null,{"$f":"Chart!#REF!","v":{"$error":"#REF!"}},{"$f":"Chart!#REF!","v":{"$error":"#REF!"}},{"$f":"Chart!#REF!","v":{"$error":"#REF!"}},{"$f":"Chart!#REF!","v":{"$error":"#REF!"}}]
[null,null,null,null,null,null,null,null,null,null,null,null,null,null,null,null,null,null,null,null,{"$f":"Chart!#REF!","v":{"$error":"#REF!"}},{"$f":"Chart!#REF!","v":{"$error":"#REF!"}},{"$f":"Chart!#REF!","v":{"$error":"#REF!"}},{"$f":"Chart!#REF!","v":{"$error":"#REF!"}}]
[null,null,null,null,null,null,null,null,null,null,null,null,null,null,null,null,null,null,null,null,{"$f":"Chart!#REF!","v":{"$error":"#REF!"}},{"$f":"Chart!#REF!","v":{"$error":"#REF!"}},{"$f":"Chart!#REF!","v":{"$error":"#REF!"}},{"$f":"Chart!#REF!","v":{"$error":"#REF!"}}]
[null,null,null,null,null,null,null,null,null,null,null,null,null,null,null,null,null,null,null,null,{"$f":"Chart!#REF!","v":{"$error":"#REF!"}},{"$f":"Chart!#REF!","v":{"$error":"#REF!"}},{"$f":"Chart!#REF!","v":{"$error":"#REF!"}},{"$f":"Chart!#REF!","v":{"$error":"#REF!"}}]
[null,null,null,null,null,null,null,null,null,null,null,null,null,null,null,null,null,null,null,null,{"$f":"Chart!#REF!","v":{"$error":"#REF!"}},{"$f":"Chart!#REF!","v":{"$error":"#REF!"}},{"$f":"Chart!#REF!","v":{"$error":"#REF!"}},{"$f":"Chart!#REF!","v":{"$error":"#REF!"}}]
[null,null,null,null,null,null,null,null,null,null,null,null,null,null,null,null,null,null,null,null,{"$f":"Chart!#REF!","v":{"$error":"#REF!"}},{"$f":"Chart!#REF!","v":{"$error":"#REF!"}},{"$f":"Chart!#REF!","v":{"$error":"#REF!"}},{"$f":"Chart!#REF!","v":{"$error":"#REF!"}}]
[null,null,null,null,null,null,null,null,null,null,null,null,null,null,null,null,null,null,null,null,{"$f":"Chart!#REF!","v":{"$error":"#REF!"}},{"$f":"Chart!#REF!","v":{"$error":"#REF!"}},{"$f":"Chart!#REF!","v":{"$error":"#REF!"}},{"$f":"Chart!#REF!","v":{"$error":"#REF!"}}]
[null,null,null,null,null,null,null,null,null,null,null,null,null,null,null,null,null,null,null,null,{"$f":"Chart!#REF!","v":{"$error":"#REF!"}},{"$f":"Chart!#REF!","v":{"$error":"#REF!"}},{"$f":"Chart!#REF!","v":{"$error":"#REF!"}},{"$f":"Chart!#REF!","v":{"$error":"#REF!"}}]
[null,null,null,null,null,null,null,null,null,null,null,null,null,null,null,null,null,null,null,null,{"$f":"Chart!#REF!","v":{"$error":"#REF!"}},{"$f":"Chart!#REF!","v":{"$error":"#REF!"}},{"$f":"Chart!#REF!","v":{"$error":"#REF!"}},{"$f":"Chart!#REF!","v":{"$error":"#REF!"}}]
[null,null,null,null,null,null,null,null,null,null,null,null,null,null,null,null,null,null,null,null,{"$f":"Chart!#REF!","v":{"$error":"#REF!"}},{"$f":"Chart!#REF!","v":{"$error":"#REF!"}},{"$f":"Chart!#REF!","v":{"$error":"#REF!"}},{"$f":"Chart!#REF!","v":{"$error":"#REF!"}}]
[null,null,null,null,null,null,null,null,null,null,null,null,null,null,null,null,null,null,null,null,{"$f":"Chart!#REF!","v":{"$error":"#REF!"}},{"$f":"Chart!#REF!","v":{"$error":"#REF!"}},{"$f":"Chart!#REF!","v":{"$error":"#REF!"}},{"$f":"Chart!#REF!","v":{"$error":"#REF!"}}]
[null,null,null,null,null,null,null,null,null,null,null,null,null,null,null,null,null,null,null,null,{"$f":"Chart!#REF!","v":{"$error":"#REF!"}},{"$f":"Chart!#REF!","v":{"$error":"#REF!"}},{"$f":"Chart!#REF!","v":{"$error":"#REF!"}},{"$f":"Chart!#REF!","v":{"$error":"#REF!"}}]
[null,null,null,null,null,null,null,null,null,null,null,null,null,null,null,null,null,null,null,null,{"$f":"Chart!#REF!","v":{"$error":"#REF!"}},{"$f":"Chart!#REF!","v":{"$error":"#REF!"}},{"$f":"Chart!#REF!","v":{"$error":"#REF!"}},{"$f":"Chart!#REF!","v":{"$error":"#REF!"}}]
[null,null,null,null,null,null,null,null,null,null,null,null,null,null,null,null,null,null,null,null,{"$f":"Chart!#REF!","v":{"$error":"#REF!"}},{"$f":"Chart!#REF!","v":{"$error":"#REF!"}},{"$f":"Chart!#REF!","v":{"$error":"#REF!"}},{"$f":"Chart!#REF!","v":{"$error":"#REF!"}}]
[null,null,null,null,null,null,null,null,null,null,null,null,null,null,null,null,null,null,null,null,{"$f":"Chart!#REF!","v":{"$error":"#REF!"}},{"$f":"Chart!#REF!","v":{"$error":"#REF!"}},{"$f":"Chart!#REF!","v":{"$error":"#REF!"}},{"$f":"Chart!#REF!","v":{"$error":"#REF!"}}]
[null,null,null,null,null,null,null,null,null,null,null,null,null,null,null,null,null,null,null,null,{"$f":"Chart!#REF!","v":{"$error":"#REF!"}},{"$f":"Chart!#REF!","v":{"$error":"#REF!"}},{"$f":"Chart!#REF!","v":{"$error":"#REF!"}},{"$f":"Chart!#REF!","v":{"$error":"#REF!"}}]
[null,null,null,null,null,null,null,null,null,null,null,null,null,null,null,null,null,null,null,null,{"$f":"Chart!#REF!","v":{"$error":"#REF!"}},{"$f":"Chart!#REF!","v":{"$error":"#REF!"}},{"$f":"Chart!#REF!","v":{"$error":"#REF!"}},{"$f":"Chart!#REF!","v":{"$error":"#REF!"}}]
[null,null,null,null,null,null,null,null,null,null,null,null,null,null,null,null,null,null,null,null,{"$f":"Chart!#REF!","v":{"$error":"#REF!"}},{"$f":"Chart!#REF!","v":{"$error":"#REF!"}},{"$f":"Chart!#REF!","v":{"$error":"#REF!"}},{"$f":"Chart!#REF!","v":{"$error":"#REF!"}}]
[null,null,null,null,null,null,null,null,null,null,null,null,null,null,null,null,null,null,null,null,{"$f":"Chart!#REF!","v":{"$error":"#REF!"}},{"$f":"Chart!#REF!","v":{"$error":"#REF!"}},{"$f":"Chart!#REF!","v":{"$error":"#REF!"}},{"$f":"Chart!#REF!","v":{"$error":"#REF!"}}]
[null,null,null,null,null,null,null,null,null,null,null,null,null,null,null,null,null,null,null,null,{"$f":"Chart!#REF!","v":{"$error":"#REF!"}},{"$f":"Chart!#REF!","v":{"$error":"#REF!"}},{"$f":"Chart!#REF!","v":{"$error":"#REF!"}},{"$f":"Chart!#REF!","v":{"$error":"#REF!"}}]
[null,null,null,null,null,null,null,null,null,null,null,null,null,null,null,null,null,null,null,null,{"$f":"Chart!#REF!","v":{"$error":"#REF!"}},{"$f":"Chart!#REF!","v":{"$error":"#REF!"}},{"$f":"Chart!#REF!","v":{"$error":"#REF!"}},{"$f":"Chart!#REF!","v":{"$error":"#REF!"}}]
[null,null,null,null,null,null,null,null,null,null,null,null,null,null,null,null,null,null,null,null,{"$f":"Chart!#REF!","v":{"$error":"#REF!"}},{"$f":"Chart!#REF!","v":{"$error":"#REF!"}},{"$f":"Chart!#REF!","v":{"$error":"#REF!"}},{"$f":"Chart!#REF!","v":{"$error":"#REF!"}}]
[null,null,null,null,null,null,null,null,null,null,null,null,null,null,null,null,null,null,null,null,{"$f":"Chart!#REF!","v":{"$error":"#REF!"}},{"$f":"Chart!#REF!","v":{"$error":"#REF!"}},{"$f":"Chart!#REF!","v":{"$error":"#REF!"}},{"$f":"Chart!#REF!","v":{"$error":"#REF!"}}]
[null,null,null,null,null,null,null,null,null,null,null,null,null,null,null,null,null,null,null,null,{"$f":"Chart!#REF!","v":{"$error":"#REF!"}},{"$f":"Chart!#REF!","v":{"$error":"#REF!"}},{"$f":"Chart!#REF!","v":{"$error":"#REF!"}},{"$f":"Chart!#REF!","v":{"$error":"#REF!"}}]
[null,null,null,null,null,null,null,null,null,null,null,null,null,null,null,null,null,null,null,null,{"$f":"Chart!#REF!","v":{"$error":"#REF!"}},{"$f":"Chart!#REF!","v":{"$error":"#REF!"}},{"$f":"Chart!#REF!","v":{"$error":"#REF!"}},{"$f":"Chart!#REF!","v":{"$error":"#REF!"}}]

{"sheet":"Final","index":7,"n_rows":133,"n_cols":24,"rows_kept":133,"cut":false,"hidden":false,"merged":[[0,1,0,7],[1,1,1,7],[2,1,2,7],[3,1,3,7],[13,1,14,1],[17,1,18,1],[19,1,20,1],[5,1,6,1],[7,1,8,1],[9,1,10,1],[11,1,12,1],[15,1,16,1],[29,1,30,1],[31,1,32,1],[33,1,34,1],[35,1,36,1],[21,1,22,1],[23,1,24,1],[25,1,26,1],[27,1,28,1],[45,1,46,1],[47,1,48,1],[49,1,50,1],[51,1,52,1],[37,1,38,1],[39,1,40,1],[41,1,42,1],[43,1,44,1],[61,1,62,1],[63,1,64,1],[65,1,66,1],[67,1,68,1],[53,1,54,1],[55,1,56,1],[57,1,58,1],[59,1,60,1]]}
[null,{"$f":"Chart!$A$1","v":"BOWRAL BOWLS MIXED PAIRS 2022 10AM START"}]
[null,"Men's Pairs - Final"]
[null,"2013-07-06"]
[null,"Roll up at 12.40pm for 1.00pm Start"]
[null,"Match No.",null,null,"Match No."]
[null,1,{"$f":"VLOOKUP($H6,U6:X133,4,FALSE)","v":{"$error":"#N/A"}},{"$f":"VLOOKUP($H6,U6:X133,3,FALSE)","v":{"$error":"#N/A"}},null,{"$f":"VLOOKUP($H6,U6:X133,2,FALSE)","v":{"$error":"#N/A"}},{"$f":"Chart!$B$8","v":"A. MOORE"},{"$f":"Chart!$K$23","v":""},null,null,null,null,null,null,null,null,null,null,null,null,{"$f":"Chart!$E$8","v":"T. BUTT"},{"$f":"Chart!$D$8","v":0},{"$f":"Chart!$C$8","v":0},{"$f":"Chart!$B$8","v":"A. MOORE"}]
[null,null,{"$f":"VLOOKUP($H7,U7:X134,4,FALSE)","v":{"$error":"#N/A"}},{"$f":"VLOOKUP($H7,U7:X134,3,FALSE)","v":{"$error":"#N/A"}},null,{"$f":"VLOOKUP($H7,U7:X134,2,FALSE)","v":{"$error":"#N/A"}},null,{"$f":"Chart!$K$63","v":""},null,null,null,null,null,null,null,null,null,null,null,null,{"$f":"Chart!$E$12","v":"E. HALL"},{"$f":"Chart!$D$12","v":0},{"$f":"Chart!$C$12","v":0},{"$f":"Chart!$B$12","v":"B. CROWLEY"}]
[null,null,null,null,null,null,null,null,null,null,null,null,null,null,null,null,null,null,null,null,{"$f":"Chart!$E$18","v":"Bye"},{"$f":"Chart!$D$18","v":0},{"$f":"Chart!$C$18","v":0},{"$f":"Chart!$B$18","v":0}]
[null,null,null,null,null,null,null,null,null,null,null,null,null,null,null,null,null,null,null,null,{"$f":"Chart!$E$22","v":"N. BOYERS"},{"$f":"Chart!$D$22","v":0},{"$f":"Chart!$C$22","v":0},{"$f":"Chart!$B$22","v":"R. SOUTH"}]
[null,null,null,null,null,null,null,null,null,null,null,null,null,null,null,null,null,null,null,null,{"$f":"Chart!$E$28","v":"B. PORTER"},{"$f":"Chart!$D$28","v":0},{"$f":"Chart!$C$28","v":0},{"$f":"Chart!$B$28","v":"L. BOSHIER"}]
[null,null,null,null,null,null,null,null,null,null,null,null,null,null,null,null,null,null,null,null,{"$f":"Chart!$E$32","v":"K.STAFFORD"},{"$f":"Chart!$D$32","v":0},{"$f":"Chart!$C$32","v":0},{"$f":"Chart!$B$32","v":"J. HAYDEN"}]
[null,null,null,null,null,null,null,null,null,null,null,null,null,null,null,null,null,null,null,null,{"$f":"Chart!$E$38","v":"Bye"},{"$f":"Chart!$D$38","v":0},{"$f":"Chart!$C$38","v":0},{"$f":"Chart!$B$38","v":0}]
[null,null,null,null,null,null,null,null,null,null,null,null,null,null,null,null,null,null,null,null,{"$f":"Chart!$E$42","v":"C. SPILKER"},{"$f":"Chart!$D$42","v":0},{"$f":"Chart!$C$42","v":0},{"$f":"Chart!$B$42","v":"A. LAMB"}]
[null,null,null,null,null,null,null,null,null,null,null,null,null,null,null,null,null,null,null,null,{"$f":"Chart!$E$48","v":"G. FRASER"},{"$f":"Chart!$D$48","v":0},{"$f":"Chart!$C$48","v":0},{"$f":"Chart!$B$48","v":"J. NEELY"}]
[null,null,null,null,null,null,null,null,null,null,null,null,null,null,null,null,null,null,null,null,{"$f":"Chart!$E$52","v":"B. EDWARDS"},{"$f":"Chart!$D$52","v":0},{"$f":"Chart!$C$52","v":0},{"$f":"Chart!$B$52","v":"E. JONES"}]
[null,null,null,null,null,null,null,null,null,null,null,null,null,null,null,null,null,null,null,null,{"$f":"Chart!$E$58","v":"Bye"},{"$f":"Chart!$D$58","v":0},{"$f":"Chart!$C$58","v":0},{"$f":"Chart!$B$58","v":0}]
[null,null,null,null,null,null,null,null,null,null,null,null,null,null,null,null,null,null,null,null,{"$f":"Chart!$E$62","v":"B. CLAYTON"},{"$f":"Chart!$D$62","v":0},{"$f":"Chart!$C$62","v":0},{"$f":"Chart!$B$62","v":"A CONNOR"}]
[null,null,null,null,null,null,null,null,null,null,null,null,null,null,null,null,null,null,null,null,{"$f":"Chart!$E$68","v":"Bye"},{"$f":"Chart!$D$68","v":0},{"$f":"Chart!$C$68","v":0},{"$f":"Chart!$B$68","v":0}]
[null,null,null,null,null,null,null,null,null,null,null,null,null,null,null,null,null,null,null,null,{"$f":"Chart!$E$72","v":"E. BROWN"},{"$f":"Chart!$D$72","v":0},{"$f":"Chart!$C$72","v":0},{"$f":"Chart!$B$72","v":"D. COLEMAN"}]
[null,null,null,null,null,null,null,null,null,null,null,null,null,null,null,null,null,null,null,null,{"$f":"Chart!$E$78","v":"Bye"},{"$f":"Chart!$D$78","v":0},{"$f":"Chart!$C$78","v":0},{"$f":"Chart!$B$78","v":0}]
[null,null,null,null,null,null,null,null,null,null,null,null,null,null,null,null,null,null,null,null,{"$f":"Chart!$E$82","v":"A. McGHEE"},{"$f":"Chart!$D$82","v":0},{"$f":"Chart!$C$82","v":0},{"$f":"Chart!$B$82","v":"E. SHEPHERD"}]
[null,null,null,null,null,null,null,null,null,null,null,null,null,null,null,null,null,null,null,null,{"$f":"Chart!#REF!","v":{"$error":"#REF!"}},{"$f":"Chart!#REF!","v":{"$error":"#REF!"}},{"$f":"Chart!#REF!","v":{"$error":"#REF!"}},{"$f":"Chart!#REF!","v":{"$error":"#REF!"}}]
[null,null,null,null,null,null,null,null,null,null,null,null,null,null,null,null,null,null,null,null,{"$f":"Chart!#REF!","v":{"$error":"#REF!"}},{"$f":"Chart!#REF!","v":{"$error":"#REF!"}},{"$f":"Chart!#REF!","v":{"$error":"#REF!"}},{"$f":"Chart!#REF!","v":{"$error":"#REF!"}}]
[null,null,null,null,null,null,null,null,null,null,null,null,null,null,null,null,null,null,null,null,{"$f":"Chart!#REF!","v":{"$error":"#REF!"}},{"$f":"Chart!#REF!","v":{"$error":"#REF!"}},{"$f":"Chart!#REF!","v":{"$error":"#REF!"}},{"$f":"Chart!#REF!","v":{"$error":"#REF!"}}]
[null,null,null,null,null,null,null,null,null,null,null,null,null,null,null,null,null,null,null,null,{"$f":"Chart!#REF!","v":{"$error":"#REF!"}},{"$f":"Chart!#REF!","v":{"$error":"#REF!"}},{"$f":"Chart!#REF!","v":{"$error":"#REF!"}},{"$f":"Chart!#REF!","v":{"$error":"#REF!"}}]
[null,null,null,null,null,null,null,null,null,null,null,null,null,null,null,null,null,null,null,null,{"$f":"Chart!#REF!","v":{"$error":"#REF!"}},{"$f":"Chart!#REF!","v":{"$error":"#REF!"}},{"$f":"Chart!#REF!","v":{"$error":"#REF!"}},{"$f":"Chart!#REF!","v":{"$error":"#REF!"}}]
[null,null,null,null,null,null,null,null,null,null,null,null,null,null,null,null,null,null,null,null,{"$f":"Chart!#REF!","v":{"$error":"#REF!"}},{"$f":"Chart!#REF!","v":{"$error":"#REF!"}},{"$f":"Chart!#REF!","v":{"$error":"#REF!"}},{"$f":"Chart!#REF!","v":{"$error":"#REF!"}}]
[null,null,null,null,null,null,null,null,null,null,null,null,null,null,null,null,null,null,null,null,{"$f":"Chart!#REF!","v":{"$error":"#REF!"}},{"$f":"Chart!#REF!","v":{"$error":"#REF!"}},{"$f":"Chart!#REF!","v":{"$error":"#REF!"}},{"$f":"Chart!#REF!","v":{"$error":"#REF!"}}]
[null,null,null,null,null,null,null,null,null,null,null,null,null,null,null,null,null,null,null,null,{"$f":"Chart!#REF!","v":{"$error":"#REF!"}},{"$f":"Chart!#REF!","v":{"$error":"#REF!"}},{"$f":"Chart!#REF!","v":{"$error":"#REF!"}},{"$f":"Chart!#REF!","v":{"$error":"#REF!"}}]
[null,null,null,null,null,null,null,null,null,null,null,null,null,null,null,null,null,null,null,null,{"$f":"Chart!#REF!","v":{"$error":"#REF!"}},{"$f":"Chart!#REF!","v":{"$error":"#REF!"}},{"$f":"Chart!#REF!","v":{"$error":"#REF!"}},{"$f":"Chart!#REF!","v":{"$error":"#REF!"}}]
[null,null,null,null,null,null,null,null,null,null,null,null,null,null,null,null,null,null,null,null,{"$f":"Chart!#REF!","v":{"$error":"#REF!"}},{"$f":"Chart!#REF!","v":{"$error":"#REF!"}},{"$f":"Chart!#REF!","v":{"$error":"#REF!"}},{"$f":"Chart!#REF!","v":{"$error":"#REF!"}}]
[null,null,null,null,null,null,null,null,null,null,null,null,null,null,null,null,null,null,null,null,{"$f":"Chart!#REF!","v":{"$error":"#REF!"}},{"$f":"Chart!#REF!","v":{"$error":"#REF!"}},{"$f":"Chart!#REF!","v":{"$error":"#REF!"}},{"$f":"Chart!#REF!","v":{"$error":"#REF!"}}]
[null,null,null,null,null,null,null,null,null,null,null,null,null,null,null,null,null,null,null,null,{"$f":"Chart!#REF!","v":{"$error":"#REF!"}},{"$f":"Chart!#REF!","v":{"$error":"#REF!"}},{"$f":"Chart!#REF!","v":{"$error":"#REF!"}},{"$f":"Chart!#REF!","v":{"$error":"#REF!"}}]
[null,null,null,null,null,null,null,null,null,null,null,null,null,null,null,null,null,null,null,null,{"$f":"Chart!#REF!","v":{"$error":"#REF!"}},{"$f":"Chart!#REF!","v":{"$error":"#REF!"}},{"$f":"Chart!#REF!","v":{"$error":"#REF!"}},{"$f":"Chart!#REF!","v":{"$error":"#REF!"}}]
[null,null,null,null,null,null,null,null,null,null,null,null,null,null,null,null,null,null,null,null,{"$f":"Chart!#REF!","v":{"$error":"#REF!"}},{"$f":"Chart!#REF!","v":{"$error":"#REF!"}},{"$f":"Chart!#REF!","v":{"$error":"#REF!"}},{"$f":"Chart!#REF!","v":{"$error":"#REF!"}}]
[null,null,null,null,null,null,null,null,null,null,null,null,null,null,null,null,null,null,null,null,{"$f":"Chart!#REF!","v":{"$error":"#REF!"}},{"$f":"Chart!#REF!","v":{"$error":"#REF!"}},{"$f":"Chart!#REF!","v":{"$error":"#REF!"}},{"$f":"Chart!#REF!","v":{"$error":"#REF!"}}]
[null,null,null,null,null,null,null,null,null,null,null,null,null,null,null,null,null,null,null,null,{"$f":"Chart!#REF!","v":{"$error":"#REF!"}},{"$f":"Chart!#REF!","v":{"$error":"#REF!"}},{"$f":"Chart!#REF!","v":{"$error":"#REF!"}},{"$f":"Chart!#REF!","v":{"$error":"#REF!"}}]
[null,null,null,null,null,null,null,null,null,null,null,null,null,null,null,null,null,null,null,null,{"$f":"Chart!#REF!","v":{"$error":"#REF!"}},{"$f":"Chart!#REF!","v":{"$error":"#REF!"}},{"$f":"Chart!#REF!","v":{"$error":"#REF!"}},{"$f":"Chart!#REF!","v":{"$error":"#REF!"}}]
[null,null,null,null,null,null,null,null,null,null,null,null,null,null,null,null,null,null,null,null,{"$f":"Chart!#REF!","v":{"$error":"#REF!"}},{"$f":"Chart!#REF!","v":{"$error":"#REF!"}},{"$f":"Chart!#REF!","v":{"$error":"#REF!"}},{"$f":"Chart!#REF!","v":{"$error":"#REF!"}}]
[null,null,null,null,null,null,null,null,null,null,null,null,null,null,null,null,null,null,null,null,{"$f":"Chart!#REF!","v":{"$error":"#REF!"}},{"$f":"Chart!#REF!","v":{"$error":"#REF!"}},{"$f":"Chart!#REF!","v":{"$error":"#REF!"}},{"$f":"Chart!#REF!","v":{"$error":"#REF!"}}]
[null,null,null,null,null,null,null,null,null,null,null,null,null,null,null,null,null,null,null,null,{"$f":"Chart!#REF!","v":{"$error":"#REF!"}},{"$f":"Chart!#REF!","v":{"$error":"#REF!"}},{"$f":"Chart!#REF!","v":{"$error":"#REF!"}},{"$f":"Chart!#REF!","v":{"$error":"#REF!"}}]
[null,null,null,null,null,null,null,null,null,null,null,null,null,null,null,null,null,null,null,null,{"$f":"Chart!#REF!","v":{"$error":"#REF!"}},{"$f":"Chart!#REF!","v":{"$error":"#REF!"}},{"$f":"Chart!#REF!","v":{"$error":"#REF!"}},{"$f":"Chart!#REF!","v":{"$error":"#REF!"}}]
[null,null,null,null,null,null,null,null,null,null,null,null,null,null,null,null,null,null,null,null,{"$f":"Chart!#REF!","v":{"$error":"#REF!"}},{"$f":"Chart!#REF!","v":{"$error":"#REF!"}},{"$f":"Chart!#REF!","v":{"$error":"#REF!"}},{"$f":"Chart!#REF!","v":{"$error":"#REF!"}}]
[null,null,null,null,null,null,null,null,null,null,null,null,null,null,null,null,null,null,null,null,{"$f":"Chart!#REF!","v":{"$error":"#REF!"}},{"$f":"Chart!#REF!","v":{"$error":"#REF!"}},{"$f":"Chart!#REF!","v":{"$error":"#REF!"}},{"$f":"Chart!#REF!","v":{"$error":"#REF!"}}]
[null,null,null,null,null,null,null,null,null,null,null,null,null,null,null,null,null,null,null,null,{"$f":"Chart!#REF!","v":{"$error":"#REF!"}},{"$f":"Chart!#REF!","v":{"$error":"#REF!"}},{"$f":"Chart!#REF!","v":{"$error":"#REF!"}},{"$f":"Chart!#REF!","v":{"$error":"#REF!"}}]
[null,null,null,null,null,null,null,null,null,null,null,null,null,null,null,null,null,null,null,null,{"$f":"Chart!#REF!","v":{"$error":"#REF!"}},{"$f":"Chart!#REF!","v":{"$error":"#REF!"}},{"$f":"Chart!#REF!","v":{"$error":"#REF!"}},{"$f":"Chart!#REF!","v":{"$error":"#REF!"}}]
[null,null,null,null,null,null,null,null,null,null,null,null,null,null,null,null,null,null,null,null,{"$f":"Chart!#REF!","v":{"$error":"#REF!"}},{"$f":"Chart!#REF!","v":{"$error":"#REF!"}},{"$f":"Chart!#REF!","v":{"$error":"#REF!"}},{"$f":"Chart!#REF!","v":{"$error":"#REF!"}}]
[null,null,null,null,null,null,null,null,null,null,null,null,null,null,null,null,null,null,null,null,{"$f":"Chart!#REF!","v":{"$error":"#REF!"}},{"$f":"Chart!#REF!","v":{"$error":"#REF!"}},{"$f":"Chart!#REF!","v":{"$error":"#REF!"}},{"$f":"Chart!#REF!","v":{"$error":"#REF!"}}]
[null,null,null,null,null,null,null,null,null,null,null,null,null,null,null,null,null,null,null,null,{"$f":"Chart!#REF!","v":{"$error":"#REF!"}},{"$f":"Chart!#REF!","v":{"$error":"#REF!"}},{"$f":"Chart!#REF!","v":{"$error":"#REF!"}},{"$f":"Chart!#REF!","v":{"$error":"#REF!"}}]
[null,null,null,null,null,null,null,null,null,null,null,null,null,null,null,null,null,null,null,null,{"$f":"Chart!#REF!","v":{"$error":"#REF!"}},{"$f":"Chart!#REF!","v":{"$error":"#REF!"}},{"$f":"Chart!#REF!","v":{"$error":"#REF!"}},{"$f":"Chart!#REF!","v":{"$error":"#REF!"}}]
[null,null,null,null,null,null,null,null,null,null,null,null,null,null,null,null,null,null,null,null,{"$f":"Chart!#REF!","v":{"$error":"#REF!"}},{"$f":"Chart!#REF!","v":{"$error":"#REF!"}},{"$f":"Chart!#REF!","v":{"$error":"#REF!"}},{"$f":"Chart!#REF!","v":{"$error":"#REF!"}}]
[null,null,null,null,null,null,null,null,null,null,null,null,null,null,null,null,null,null,null,null,{"$f":"Chart!#REF!","v":{"$error":"#REF!"}},{"$f":"Chart!#REF!","v":{"$error":"#REF!"}},{"$f":"Chart!#REF!","v":{"$error":"#REF!"}},{"$f":"Chart!#REF!","v":{"$error":"#REF!"}}]
[null,null,null,null,null,null,null,null,null,null,null,null,null,null,null,null,null,null,null,null,{"$f":"Chart!#REF!","v":{"$error":"#REF!"}},{"$f":"Chart!#REF!","v":{"$error":"#REF!"}},{"$f":"Chart!#REF!","v":{"$error":"#REF!"}},{"$f":"Chart!#REF!","v":{"$error":"#REF!"}}]
[null,null,null,null,null,null,null,null,null,null,null,null,null,null,null,null,null,null,null,null,{"$f":"Chart!#REF!","v":{"$error":"#REF!"}},{"$f":"Chart!#REF!","v":{"$error":"#REF!"}},{"$f":"Chart!#REF!","v":{"$error":"#REF!"}},{"$f":"Chart!#REF!","v":{"$error":"#REF!"}}]
[null,null,null,null,null,null,null,null,null,null,null,null,null,null,null,null,null,null,null,null,{"$f":"Chart!#REF!","v":{"$error":"#REF!"}},{"$f":"Chart!#REF!","v":{"$error":"#REF!"}},{"$f":"Chart!#REF!","v":{"$error":"#REF!"}},{"$f":"Chart!#REF!","v":{"$error":"#REF!"}}]
[null,null,null,null,null,null,null,null,null,null,null,null,null,null,null,null,null,null,null,null,{"$f":"Chart!#REF!","v":{"$error":"#REF!"}},{"$f":"Chart!#REF!","v":{"$error":"#REF!"}},{"$f":"Chart!#REF!","v":{"$error":"#REF!"}},{"$f":"Chart!#REF!","v":{"$error":"#REF!"}}]
[null,null,null,null,null,null,null,null,null,null,null,null,null,null,null,null,null,null,null,null,{"$f":"Chart!#REF!","v":{"$error":"#REF!"}},{"$f":"Chart!#REF!","v":{"$error":"#REF!"}},{"$f":"Chart!#REF!","v":{"$error":"#REF!"}},{"$f":"Chart!#REF!","v":{"$error":"#REF!"}}]
[null,null,null,null,null,null,null,null,null,null,null,null,null,null,null,null,null,null,null,null,{"$f":"Chart!#REF!","v":{"$error":"#REF!"}},{"$f":"Chart!#REF!","v":{"$error":"#REF!"}},{"$f":"Chart!#REF!","v":{"$error":"#REF!"}},{"$f":"Chart!#REF!","v":{"$error":"#REF!"}}]
[null,null,null,null,null,null,null,null,null,null,null,null,null,null,null,null,null,null,null,null,{"$f":"Chart!#REF!","v":{"$error":"#REF!"}},{"$f":"Chart!#REF!","v":{"$error":"#REF!"}},{"$f":"Chart!#REF!","v":{"$error":"#REF!"}},{"$f":"Chart!#REF!","v":{"$error":"#REF!"}}]
[null,null,null,null,null,null,null,null,null,null,null,null,null,null,null,null,null,null,null,null,{"$f":"Chart!#REF!","v":{"$error":"#REF!"}},{"$f":"Chart!#REF!","v":{"$error":"#REF!"}},{"$f":"Chart!#REF!","v":{"$error":"#REF!"}},{"$f":"Chart!#REF!","v":{"$error":"#REF!"}}]
[null,null,null,null,null,null,null,null,null,null,null,null,null,null,null,null,null,null,null,null,{"$f":"Chart!#REF!","v":{"$error":"#REF!"}},{"$f":"Chart!#REF!","v":{"$error":"#REF!"}},{"$f":"Chart!#REF!","v":{"$error":"#REF!"}},{"$f":"Chart!#REF!","v":{"$error":"#REF!"}}]
[null,null,null,null,null,null,null,null,null,null,null,null,null,null,null,null,null,null,null,null,{"$f":"Chart!#REF!","v":{"$error":"#REF!"}},{"$f":"Chart!#REF!","v":{"$error":"#REF!"}},{"$f":"Chart!#REF!","v":{"$error":"#REF!"}},{"$f":"Chart!#REF!","v":{"$error":"#REF!"}}]
[null,null,null,null,null,null,null,null,null,null,null,null,null,null,null,null,null,null,null,null,{"$f":"Chart!#REF!","v":{"$error":"#REF!"}},{"$f":"Chart!#REF!","v":{"$error":"#REF!"}},{"$f":"Chart!#REF!","v":{"$error":"#REF!"}},{"$f":"Chart!#REF!","v":{"$error":"#REF!"}}]
[null,null,null,null,null,null,null,null,null,null,null,null,null,null,null,null,null,null,null,null,{"$f":"Chart!#REF!","v":{"$error":"#REF!"}},{"$f":"Chart!#REF!","v":{"$error":"#REF!"}},{"$f":"Chart!#REF!","v":{"$error":"#REF!"}},{"$f":"Chart!#REF!","v":{"$error":"#REF!"}}]
[null,null,null,null,null,null,null,null,null,null,null,null,null,null,null,null,null,null,null,null,{"$f":"Chart!#REF!","v":{"$error":"#REF!"}},{"$f":"Chart!#REF!","v":{"$error":"#REF!"}},{"$f":"Chart!#REF!","v":{"$error":"#REF!"}},{"$f":"Chart!#REF!","v":{"$error":"#REF!"}}]
[null,null,null,null,null,null,null,null,null,null,null,null,null,null,null,null,null,null,null,null,{"$f":"Chart!#REF!","v":{"$error":"#REF!"}},{"$f":"Chart!#REF!","v":{"$error":"#REF!"}},{"$f":"Chart!#REF!","v":{"$error":"#REF!"}},{"$f":"Chart!#REF!","v":{"$error":"#REF!"}}]
[null,null,null,null,null,null,null,null,null,null,null,null,null,null,null,null,null,null,null,null,{"$f":"Chart!#REF!","v":{"$error":"#REF!"}},{"$f":"Chart!#REF!","v":{"$error":"#REF!"}},{"$f":"Chart!#REF!","v":{"$error":"#REF!"}},{"$f":"Chart!#REF!","v":{"$error":"#REF!"}}]
[null,null,null,null,null,null,null,null,null,null,null,null,null,null,null,null,null,null,null,null,{"$f":"Chart!#REF!","v":{"$error":"#REF!"}},{"$f":"Chart!#REF!","v":{"$error":"#REF!"}},{"$f":"Chart!#REF!","v":{"$error":"#REF!"}},{"$f":"Chart!#REF!","v":{"$error":"#REF!"}}]
[null,null,null,null,null,null,null,null,null,null,null,null,null,null,null,null,null,null,null,null,{"$f":"Chart!#REF!","v":{"$error":"#REF!"}},{"$f":"Chart!#REF!","v":{"$error":"#REF!"}},{"$f":"Chart!#REF!","v":{"$error":"#REF!"}},{"$f":"Chart!#REF!","v":{"$error":"#REF!"}}]
[null,null,null,null,null,null,null,null,null,null,null,null,null,null,null,null,null,null,null,null,{"$f":"Chart!#REF!","v":{"$error":"#REF!"}},{"$f":"Chart!#REF!","v":{"$error":"#REF!"}},{"$f":"Chart!#REF!","v":{"$error":"#REF!"}},{"$f":"Chart!#REF!","v":{"$error":"#REF!"}}]
[null,null,null,null,null,null,null,null,null,null,null,null,null,null,null,null,null,null,null,null,{"$f":"Chart!#REF!","v":{"$error":"#REF!"}},{"$f":"Chart!#REF!","v":{"$error":"#REF!"}},{"$f":"Chart!#REF!","v":{"$error":"#REF!"}},{"$f":"Chart!#REF!","v":{"$error":"#REF!"}}]
[null,null,null,null,null,null,null,null,null,null,null,null,null,null,null,null,null,null,null,null,{"$f":"Chart!#REF!","v":{"$error":"#REF!"}},{"$f":"Chart!#REF!","v":{"$error":"#REF!"}},{"$f":"Chart!#REF!","v":{"$error":"#REF!"}},{"$f":"Chart!#REF!","v":{"$error":"#REF!"}}]
[null,null,null,null,null,null,null,null,null,null,null,null,null,null,null,null,null,null,null,null,{"$f":"Chart!#REF!","v":{"$error":"#REF!"}},{"$f":"Chart!#REF!","v":{"$error":"#REF!"}},{"$f":"Chart!#REF!","v":{"$error":"#REF!"}},{"$f":"Chart!#REF!","v":{"$error":"#REF!"}}]
[null,null,null,null,null,null,null,null,null,null,null,null,null,null,null,null,null,null,null,null,{"$f":"Chart!#REF!","v":{"$error":"#REF!"}},{"$f":"Chart!#REF!","v":{"$error":"#REF!"}},{"$f":"Chart!#REF!","v":{"$error":"#REF!"}},{"$f":"Chart!#REF!","v":{"$error":"#REF!"}}]
[null,null,null,null,null,null,null,null,null,null,null,null,null,null,null,null,null,null,null,null,{"$f":"Chart!#REF!","v":{"$error":"#REF!"}},{"$f":"Chart!#REF!","v":{"$error":"#REF!"}},{"$f":"Chart!#REF!","v":{"$error":"#REF!"}},{"$f":"Chart!#REF!","v":{"$error":"#REF!"}}]
[null,null,null,null,null,null,null,null,null,null,null,null,null,null,null,null,null,null,null,null,{"$f":"Chart!#REF!","v":{"$error":"#REF!"}},{"$f":"Chart!#REF!","v":{"$error":"#REF!"}},{"$f":"Chart!#REF!","v":{"$error":"#REF!"}},{"$f":"Chart!#REF!","v":{"$error":"#REF!"}}]
[null,null,null,null,null,null,null,null,null,null,null,null,null,null,null,null,null,null,null,null,{"$f":"Chart!#REF!","v":{"$error":"#REF!"}},{"$f":"Chart!#REF!","v":{"$error":"#REF!"}},{"$f":"Chart!#REF!","v":{"$error":"#REF!"}},{"$f":"Chart!#REF!","v":{"$error":"#REF!"}}]
[null,null,null,null,null,null,null,null,null,null,null,null,null,null,null,null,null,null,null,null,{"$f":"Chart!#REF!","v":{"$error":"#REF!"}},{"$f":"Chart!#REF!","v":{"$error":"#REF!"}},{"$f":"Chart!#REF!","v":{"$error":"#REF!"}},{"$f":"Chart!#REF!","v":{"$error":"#REF!"}}]
[null,null,null,null,null,null,null,null,null,null,null,null,null,null,null,null,null,null,null,null,{"$f":"Chart!#REF!","v":{"$error":"#REF!"}},{"$f":"Chart!#REF!","v":{"$error":"#REF!"}},{"$f":"Chart!#REF!","v":{"$error":"#REF!"}},{"$f":"Chart!#REF!","v":{"$error":"#REF!"}}]
[null,null,null,null,null,null,null,null,null,null,null,null,null,null,null,null,null,null,null,null,{"$f":"Chart!#REF!","v":{"$error":"#REF!"}},{"$f":"Chart!#REF!","v":{"$error":"#REF!"}},{"$f":"Chart!#REF!","v":{"$error":"#REF!"}},{"$f":"Chart!#REF!","v":{"$error":"#REF!"}}]
[null,null,null,null,null,null,null,null,null,null,null,null,null,null,null,null,null,null,null,null,{"$f":"Chart!#REF!","v":{"$error":"#REF!"}},{"$f":"Chart!#REF!","v":{"$error":"#REF!"}},{"$f":"Chart!#REF!","v":{"$error":"#REF!"}},{"$f":"Chart!#REF!","v":{"$error":"#REF!"}}]
[null,null,null,null,null,null,null,null,null,null,null,null,null,null,null,null,null,null,null,null,{"$f":"Chart!#REF!","v":{"$error":"#REF!"}},{"$f":"Chart!#REF!","v":{"$error":"#REF!"}},{"$f":"Chart!#REF!","v":{"$error":"#REF!"}},{"$f":"Chart!#REF!","v":{"$error":"#REF!"}}]
[null,null,null,null,null,null,null,null,null,null,null,null,null,null,null,null,null,null,null,null,{"$f":"Chart!#REF!","v":{"$error":"#REF!"}},{"$f":"Chart!#REF!","v":{"$error":"#REF!"}},{"$f":"Chart!#REF!","v":{"$error":"#REF!"}},{"$f":"Chart!#REF!","v":{"$error":"#REF!"}}]
[null,null,null,null,null,null,null,null,null,null,null,null,null,null,null,null,null,null,null,null,{"$f":"Chart!#REF!","v":{"$error":"#REF!"}},{"$f":"Chart!#REF!","v":{"$error":"#REF!"}},{"$f":"Chart!#REF!","v":{"$error":"#REF!"}},{"$f":"Chart!#REF!","v":{"$error":"#REF!"}}]
[null,null,null,null,null,null,null,null,null,null,null,null,null,null,null,null,null,null,null,null,{"$f":"Chart!#REF!","v":{"$error":"#REF!"}},{"$f":"Chart!#REF!","v":{"$error":"#REF!"}},{"$f":"Chart!#REF!","v":{"$error":"#REF!"}},{"$f":"Chart!#REF!","v":{"$error":"#REF!"}}]
[null,null,null,null,null,null,null,null,null,null,null,null,null,null,null,null,null,null,null,null,{"$f":"Chart!#REF!","v":{"$error":"#REF!"}},{"$f":"Chart!#REF!","v":{"$error":"#REF!"}},{"$f":"Chart!#REF!","v":{"$error":"#REF!"}},{"$f":"Chart!#REF!","v":{"$error":"#REF!"}}]
[null,null,null,null,null,null,null,null,null,null,null,null,null,null,null,null,null,null,null,null,{"$f":"Chart!#REF!","v":{"$error":"#REF!"}},{"$f":"Chart!#REF!","v":{"$error":"#REF!"}},{"$f":"Chart!#REF!","v":{"$error":"#REF!"}},{"$f":"Chart!#REF!","v":{"$error":"#REF!"}}]
[null,null,null,null,null,null,null,null,null,null,null,null,null,null,null,null,null,null,null,null,{"$f":"Chart!#REF!","v":{"$error":"#REF!"}},{"$f":"Chart!#REF!","v":{"$error":"#REF!"}},{"$f":"Chart!#REF!","v":{"$error":"#REF!"}},{"$f":"Chart!#REF!","v":{"$error":"#REF!"}}]
[null,null,null,null,null,null,null,null,null,null,null,null,null,null,null,null,null,null,null,null,{"$f":"Chart!#REF!","v":{"$error":"#REF!"}},{"$f":"Chart!#REF!","v":{"$error":"#REF!"}},{"$f":"Chart!#REF!","v":{"$error":"#REF!"}},{"$f":"Chart!#REF!","v":{"$error":"#REF!"}}]
[null,null,null,null,null,null,null,null,null,null,null,null,null,null,null,null,null,null,null,null,{"$f":"Chart!#REF!","v":{"$error":"#REF!"}},{"$f":"Chart!#REF!","v":{"$error":"#REF!"}},{"$f":"Chart!#REF!","v":{"$error":"#REF!"}},{"$f":"Chart!#REF!","v":{"$error":"#REF!"}}]
[null,null,null,null,null,null,null,null,null,null,null,null,null,null,null,null,null,null,null,null,{"$f":"Chart!#REF!","v":{"$error":"#REF!"}},{"$f":"Chart!#REF!","v":{"$error":"#REF!"}},{"$f":"Chart!#REF!","v":{"$error":"#REF!"}},{"$f":"Chart!#REF!","v":{"$error":"#REF!"}}]
[null,null,null,null,null,null,null,null,null,null,null,null,null,null,null,null,null,null,null,null,{"$f":"Chart!#REF!","v":{"$error":"#REF!"}},{"$f":"Chart!#REF!","v":{"$error":"#REF!"}},{"$f":"Chart!#REF!","v":{"$error":"#REF!"}},{"$f":"Chart!#REF!","v":{"$error":"#REF!"}}]
[null,null,null,null,null,null,null,null,null,null,null,null,null,null,null,null,null,null,null,null,{"$f":"Chart!#REF!","v":{"$error":"#REF!"}},{"$f":"Chart!#REF!","v":{"$error":"#REF!"}},{"$f":"Chart!#REF!","v":{"$error":"#REF!"}},{"$f":"Chart!#REF!","v":{"$error":"#REF!"}}]
[null,null,null,null,null,null,null,null,null,null,null,null,null,null,null,null,null,null,null,null,{"$f":"Chart!#REF!","v":{"$error":"#REF!"}},{"$f":"Chart!#REF!","v":{"$error":"#REF!"}},{"$f":"Chart!#REF!","v":{"$error":"#REF!"}},{"$f":"Chart!#REF!","v":{"$error":"#REF!"}}]
[null,null,null,null,null,null,null,null,null,null,null,null,null,null,null,null,null,null,null,null,{"$f":"Chart!#REF!","v":{"$error":"#REF!"}},{"$f":"Chart!#REF!","v":{"$error":"#REF!"}},{"$f":"Chart!#REF!","v":{"$error":"#REF!"}},{"$f":"Chart!#REF!","v":{"$error":"#REF!"}}]
[null,null,null,null,null,null,null,null,null,null,null,null,null,null,null,null,null,null,null,null,{"$f":"Chart!#REF!","v":{"$error":"#REF!"}},{"$f":"Chart!#REF!","v":{"$error":"#REF!"}},{"$f":"Chart!#REF!","v":{"$error":"#REF!"}},{"$f":"Chart!#REF!","v":{"$error":"#REF!"}}]
[null,null,null,null,null,null,null,null,null,null,null,null,null,null,null,null,null,null,null,null,{"$f":"Chart!#REF!","v":{"$error":"#REF!"}},{"$f":"Chart!#REF!","v":{"$error":"#REF!"}},{"$f":"Chart!#REF!","v":{"$error":"#REF!"}},{"$f":"Chart!#REF!","v":{"$error":"#REF!"}}]
[null,null,null,null,null,null,null,null,null,null,null,null,null,null,null,null,null,null,null,null,{"$f":"Chart!#REF!","v":{"$error":"#REF!"}},{"$f":"Chart!#REF!","v":{"$error":"#REF!"}},{"$f":"Chart!#REF!","v":{"$error":"#REF!"}},{"$f":"Chart!#REF!","v":{"$error":"#REF!"}}]
[null,null,null,null,null,null,null,null,null,null,null,null,null,null,null,null,null,null,null,null,{"$f":"Chart!#REF!","v":{"$error":"#REF!"}},{"$f":"Chart!#REF!","v":{"$error":"#REF!"}},{"$f":"Chart!#REF!","v":{"$error":"#REF!"}},{"$f":"Chart!#REF!","v":{"$error":"#REF!"}}]
[null,null,null,null,null,null,null,null,null,null,null,null,null,null,null,null,null,null,null,null,{"$f":"Chart!#REF!","v":{"$error":"#REF!"}},{"$f":"Chart!#REF!","v":{"$error":"#REF!"}},{"$f":"Chart!#REF!","v":{"$error":"#REF!"}},{"$f":"Chart!#REF!","v":{"$error":"#REF!"}}]
[null,null,null,null,null,null,null,null,null,null,null,null,null,null,null,null,null,null,null,null,{"$f":"Chart!#REF!","v":{"$error":"#REF!"}},{"$f":"Chart!#REF!","v":{"$error":"#REF!"}},{"$f":"Chart!#REF!","v":{"$error":"#REF!"}},{"$f":"Chart!#REF!","v":{"$error":"#REF!"}}]
[null,null,null,null,null,null,null,null,null,null,null,null,null,null,null,null,null,null,null,null,{"$f":"Chart!#REF!","v":{"$error":"#REF!"}},{"$f":"Chart!#REF!","v":{"$error":"#REF!"}},{"$f":"Chart!#REF!","v":{"$error":"#REF!"}},{"$f":"Chart!#REF!","v":{"$error":"#REF!"}}]
[null,null,null,null,null,null,null,null,null,null,null,null,null,null,null,null,null,null,null,null,{"$f":"Chart!#REF!","v":{"$error":"#REF!"}},{"$f":"Chart!#REF!","v":{"$error":"#REF!"}},{"$f":"Chart!#REF!","v":{"$error":"#REF!"}},{"$f":"Chart!#REF!","v":{"$error":"#REF!"}}]
[null,null,null,null,null,null,null,null,null,null,null,null,null,null,null,null,null,null,null,null,{"$f":"Chart!#REF!","v":{"$error":"#REF!"}},{"$f":"Chart!#REF!","v":{"$error":"#REF!"}},{"$f":"Chart!#REF!","v":{"$error":"#REF!"}},{"$f":"Chart!#REF!","v":{"$error":"#REF!"}}]
[null,null,null,null,null,null,null,null,null,null,null,null,null,null,null,null,null,null,null,null,{"$f":"Chart!#REF!","v":{"$error":"#REF!"}},{"$f":"Chart!#REF!","v":{"$error":"#REF!"}},{"$f":"Chart!#REF!","v":{"$error":"#REF!"}},{"$f":"Chart!#REF!","v":{"$error":"#REF!"}}]
[null,null,null,null,null,null,null,null,null,null,null,null,null,null,null,null,null,null,null,null,{"$f":"Chart!#REF!","v":{"$error":"#REF!"}},{"$f":"Chart!#REF!","v":{"$error":"#REF!"}},{"$f":"Chart!#REF!","v":{"$error":"#REF!"}},{"$f":"Chart!#REF!","v":{"$error":"#REF!"}}]
[null,null,null,null,null,null,null,null,null,null,null,null,null,null,null,null,null,null,null,null,{"$f":"Chart!#REF!","v":{"$error":"#REF!"}},{"$f":"Chart!#REF!","v":{"$error":"#REF!"}},{"$f":"Chart!#REF!","v":{"$error":"#REF!"}},{"$f":"Chart!#REF!","v":{"$error":"#REF!"}}]
[null,null,null,null,null,null,null,null,null,null,null,null,null,null,null,null,null,null,null,null,{"$f":"Chart!#REF!","v":{"$error":"#REF!"}},{"$f":"Chart!#REF!","v":{"$error":"#REF!"}},{"$f":"Chart!#REF!","v":{"$error":"#REF!"}},{"$f":"Chart!#REF!","v":{"$error":"#REF!"}}]
[null,null,null,null,null,null,null,null,null,null,null,null,null,null,null,null,null,null,null,null,{"$f":"Chart!#REF!","v":{"$error":"#REF!"}},{"$f":"Chart!#REF!","v":{"$error":"#REF!"}},{"$f":"Chart!#REF!","v":{"$error":"#REF!"}},{"$f":"Chart!#REF!","v":{"$error":"#REF!"}}]
[null,null,null,null,null,null,null,null,null,null,null,null,null,null,null,null,null,null,null,null,{"$f":"Chart!#REF!","v":{"$error":"#REF!"}},{"$f":"Chart!#REF!","v":{"$error":"#REF!"}},{"$f":"Chart!#REF!","v":{"$error":"#REF!"}},{"$f":"Chart!#REF!","v":{"$error":"#REF!"}}]
[null,null,null,null,null,null,null,null,null,null,null,null,null,null,null,null,null,null,null,null,{"$f":"Chart!#REF!","v":{"$error":"#REF!"}},{"$f":"Chart!#REF!","v":{"$error":"#REF!"}},{"$f":"Chart!#REF!","v":{"$error":"#REF!"}},{"$f":"Chart!#REF!","v":{"$error":"#REF!"}}]
[null,null,null,null,null,null,null,null,null,null,null,null,null,null,null,null,null,null,null,null,{"$f":"Chart!#REF!","v":{"$error":"#REF!"}},{"$f":"Chart!#REF!","v":{"$error":"#REF!"}},{"$f":"Chart!#REF!","v":{"$error":"#REF!"}},{"$f":"Chart!#REF!","v":{"$error":"#REF!"}}]
[null,null,null,null,null,null,null,null,null,null,null,null,null,null,null,null,null,null,null,null,{"$f":"Chart!#REF!","v":{"$error":"#REF!"}},{"$f":"Chart!#REF!","v":{"$error":"#REF!"}},{"$f":"Chart!#REF!","v":{"$error":"#REF!"}},{"$f":"Chart!#REF!","v":{"$error":"#REF!"}}]
[null,null,null,null,null,null,null,null,null,null,null,null,null,null,null,null,null,null,null,null,{"$f":"Chart!#REF!","v":{"$error":"#REF!"}},{"$f":"Chart!#REF!","v":{"$error":"#REF!"}},{"$f":"Chart!#REF!","v":{"$error":"#REF!"}},{"$f":"Chart!#REF!","v":{"$error":"#REF!"}}]
[null,null,null,null,null,null,null,null,null,null,null,null,null,null,null,null,null,null,null,null,{"$f":"Chart!#REF!","v":{"$error":"#REF!"}},{"$f":"Chart!#REF!","v":{"$error":"#REF!"}},{"$f":"Chart!#REF!","v":{"$error":"#REF!"}},{"$f":"Chart!#REF!","v":{"$error":"#REF!"}}]
[null,null,null,null,null,null,null,null,null,null,null,null,null,null,null,null,null,null,null,null,{"$f":"Chart!#REF!","v":{"$error":"#REF!"}},{"$f":"Chart!#REF!","v":{"$error":"#REF!"}},{"$f":"Chart!#REF!","v":{"$error":"#REF!"}},{"$f":"Chart!#REF!","v":{"$error":"#REF!"}}]
[null,null,null,null,null,null,null,null,null,null,null,null,null,null,null,null,null,null,null,null,{"$f":"Chart!#REF!","v":{"$error":"#REF!"}},{"$f":"Chart!#REF!","v":{"$error":"#REF!"}},{"$f":"Chart!#REF!","v":{"$error":"#REF!"}},{"$f":"Chart!#REF!","v":{"$error":"#REF!"}}]
[null,null,null,null,null,null,null,null,null,null,null,null,null,null,null,null,null,null,null,null,{"$f":"Chart!#REF!","v":{"$error":"#REF!"}},{"$f":"Chart!#REF!","v":{"$error":"#REF!"}},{"$f":"Chart!#REF!","v":{"$error":"#REF!"}},{"$f":"Chart!#REF!","v":{"$error":"#REF!"}}]
[null,null,null,null,null,null,null,null,null,null,null,null,null,null,null,null,null,null,null,null,{"$f":"Chart!#REF!","v":{"$error":"#REF!"}},{"$f":"Chart!#REF!","v":{"$error":"#REF!"}},{"$f":"Chart!#REF!","v":{"$error":"#REF!"}},{"$f":"Chart!#REF!","v":{"$error":"#REF!"}}]
[null,null,null,null,null,null,null,null,null,null,null,null,null,null,null,null,null,null,null,null,{"$f":"Chart!#REF!","v":{"$error":"#REF!"}},{"$f":"Chart!#REF!","v":{"$error":"#REF!"}},{"$f":"Chart!#REF!","v":{"$error":"#REF!"}},{"$f":"Chart!#REF!","v":{"$error":"#REF!"}}]
[null,null,null,null,null,null,null,null,null,null,null,null,null,null,null,null,null,null,null,null,{"$f":"Chart!#REF!","v":{"$error":"#REF!"}},{"$f":"Chart!#REF!","v":{"$error":"#REF!"}},{"$f":"Chart!#REF!","v":{"$error":"#REF!"}},{"$f":"Chart!#REF!","v":{"$error":"#REF!"}}]
[null,null,null,null,null,null,null,null,null,null,null,null,null,null,null,null,null,null,null,null,{"$f":"Chart!#REF!","v":{"$error":"#REF!"}},{"$f":"Chart!#REF!","v":{"$error":"#REF!"}},{"$f":"Chart!#REF!","v":{"$error":"#REF!"}},{"$f":"Chart!#REF!","v":{"$error":"#REF!"}}]
[null,null,null,null,null,null,null,null,null,null,null,null,null,null,null,null,null,null,null,null,{"$f":"Chart!#REF!","v":{"$error":"#REF!"}},{"$f":"Chart!#REF!","v":{"$error":"#REF!"}},{"$f":"Chart!#REF!","v":{"$error":"#REF!"}},{"$f":"Chart!#REF!","v":{"$error":"#REF!"}}]
[null,null,null,null,null,null,null,null,null,null,null,null,null,null,null,null,null,null,null,null,{"$f":"Chart!#REF!","v":{"$error":"#REF!"}},{"$f":"Chart!#REF!","v":{"$error":"#REF!"}},{"$f":"Chart!#REF!","v":{"$error":"#REF!"}},{"$f":"Chart!#REF!","v":{"$error":"#REF!"}}]
[null,null,null,null,null,null,null,null,null,null,null,null,null,null,null,null,null,null,null,null,{"$f":"Chart!#REF!","v":{"$error":"#REF!"}},{"$f":"Chart!#REF!","v":{"$error":"#REF!"}},{"$f":"Chart!#REF!","v":{"$error":"#REF!"}},{"$f":"Chart!#REF!","v":{"$error":"#REF!"}}]
[null,null,null,null,null,null,null,null,null,null,null,null,null,null,null,null,null,null,null,null,{"$f":"Chart!#REF!","v":{"$error":"#REF!"}},{"$f":"Chart!#REF!","v":{"$error":"#REF!"}},{"$f":"Chart!#REF!","v":{"$error":"#REF!"}},{"$f":"Chart!#REF!","v":{"$error":"#REF!"}}]
[null,null,null,null,null,null,null,null,null,null,null,null,null,null,null,null,null,null,null,null,{"$f":"Chart!#REF!","v":{"$error":"#REF!"}},{"$f":"Chart!#REF!","v":{"$error":"#REF!"}},{"$f":"Chart!#REF!","v":{"$error":"#REF!"}},{"$f":"Chart!#REF!","v":{"$error":"#REF!"}}]
[null,null,null,null,null,null,null,null,null,null,null,null,null,null,null,null,null,null,null,null,{"$f":"Chart!#REF!","v":{"$error":"#REF!"}},{"$f":"Chart!#REF!","v":{"$error":"#REF!"}},{"$f":"Chart!#REF!","v":{"$error":"#REF!"}},{"$f":"Chart!#REF!","v":{"$error":"#REF!"}}]
[null,null,null,null,null,null,null,null,null,null,null,null,null,null,null,null,null,null,null,null,{"$f":"Chart!#REF!","v":{"$error":"#REF!"}},{"$f":"Chart!#REF!","v":{"$error":"#REF!"}},{"$f":"Chart!#REF!","v":{"$error":"#REF!"}},{"$f":"Chart!#REF!","v":{"$error":"#REF!"}}]
[null,null,null,null,null,null,null,null,null,null,null,null,null,null,null,null,null,null,null,null,{"$f":"Chart!#REF!","v":{"$error":"#REF!"}},{"$f":"Chart!#REF!","v":{"$error":"#REF!"}},{"$f":"Chart!#REF!","v":{"$error":"#REF!"}},{"$f":"Chart!#REF!","v":{"$error":"#REF!"}}]
[null,null,null,null,null,null,null,null,null,null,null,null,null,null,null,null,null,null,null,null,{"$f":"Chart!#REF!","v":{"$error":"#REF!"}},{"$f":"Chart!#REF!","v":{"$error":"#REF!"}},{"$f":"Chart!#REF!","v":{"$error":"#REF!"}},{"$f":"Chart!#REF!","v":{"$error":"#REF!"}}]
[null,null,null,null,null,null,null,null,null,null,null,null,null,null,null,null,null,null,null,null,{"$f":"Chart!#REF!","v":{"$error":"#REF!"}},{"$f":"Chart!#REF!","v":{"$error":"#REF!"}},{"$f":"Chart!#REF!","v":{"$error":"#REF!"}},{"$f":"Chart!#REF!","v":{"$error":"#REF!"}}]
[null,null,null,null,null,null,null,null,null,null,null,null,null,null,null,null,null,null,null,null,{"$f":"Chart!#REF!","v":{"$error":"#REF!"}},{"$f":"Chart!#REF!","v":{"$error":"#REF!"}},{"$f":"Chart!#REF!","v":{"$error":"#REF!"}},{"$f":"Chart!#REF!","v":{"$error":"#REF!"}}]

{"sheet":"TEAMS","index":8,"n_rows":76,"n_cols":16,"rows_kept":76,"cut":false,"hidden":false,"merged":[[39,1,39,7],[1,7,2,7],[0,3,0,5],[1,3,1,5],[2,3,2,5]]}
[null,"CLUB","-","CLUB NAME",null,null,null,"TOTAL BOWLERS"]
[null,"DATE","-","2011-03-07",null,null,null,{"$f":"B41+D41+F41+H41+J41+L41+N41+P41","v":0}]
[null,"EVENT","-","Tuesday Mens Mufti."]
[]
[null,"RINK",null,null,null,"RINK",null,null,null,"RINK",null,null,null,"RINK"]
[null,null,"L",null,null,null,"L",null,null,null,"L",null,null,null,"L"]
[null,null,"S",null,null,null,"S",null,null,null,"S",null,null,null,"S"]
[null,null,"T",null,null,null,"T",null,null,null,"T",null,null,null,"T"]
[null,null,"Sk",null,null,null,"Sk",null,null,null,"Sk",null,null,null,"Sk"]
[null,"RINK",null,null,null,"RINK",null,null,null,"RINK",null,null,null,"RINK"]
[null,null,"L",null,null,null,"L",null,null,null,"L",null,null,null,"L"]
[null,null,"S",null,null,null,"S",null,null,null,"S",null,null,null,"S"]
[null,null,"T",null,null,null,"T",null,null,null,"T",null,null,null,"T"]
[null,null,"Sk",null,null,null,"Sk",null,null,null,"Sk",null,null,null,"Sk"]
[null,"RINK",null,null,null,"RINK",null,null,null,"RINK",null,null,null,"RINK"]
[null,null,"L",null,null,null,"L",null,null,null,"L",null,null,null,"L"]
[null,null,"S",null,null,null,"S",null,null,null,"S",null,null,null,"S"]
[null,null,"T",null,null,null,"T",null,null,null,"T",null,null,null,"T"]
[null,null,"Sk",null,null,null,"Sk",null,null,null,"Sk",null,null,null,"Sk"]
[null,"RINK",null,null,null,"RINK",null,null,null,"RINK",null,null,null,"RINK"]
[null,null,"L",null,null,null,"L",null,null,null,"L",null,null,null,"L"]
[null,null,"S",null,null,null,"S",null,null,null,"S",null,null,null,"S"]
[null,null,"T",null,null,null,"T",null,null,null,"T",null,null,null,"T"]
[null,null,"Sk",null,null,null,"Sk",null,null,null,"Sk",null,null,null,"Sk"]
[null,"RINK",null,null,null,"RINK",null,null,null,"RINK",null,null,null,"RINK"]
[null,null,"L",null,null,null,"L",null,null,null,"L",null,null,null,"L"]
[null,null,"S",null,null,null,"S",null,null,null,"S",null,null,null,"S"]
[null,null,"T",null,null,null,"T",null,null,null,"T",null,null,null,"T"]
[null,null,"Sk",null,null,null,"Sk",null,null,null,"Sk",null,null,null,"Sk"]
[null,"RINK",null,null,null,"RINK",null,null,null,"RINK",null,null,null,"RINK"]
[null,null,"L",null,null,null,"L",null,null,null,"L",null,null,null,"L"]
[null,null,"S",null,null,null,"S",null,null,null,"S",null,null,null,"S"]
[null,null,"T",null,null,null,"T",null,null,null,"T",null,null,null,"T"]
[null,null,"Sk",null,null,null,"Sk",null,null,null,"Sk",null,null,null,"Sk"]
[null,"RINK",null,null,null,"RINK",null,null,null,"RINK",null,null,null,"RINK"]
[null,null,"L",null,null,null,"L",null,null,null,"L",null,null,null,"L"]
[null,null,"S",null,null,null,"S",null,null,null,"S",null,null,null,"S"]
[null,null,"T",null,null,null,"T",null,null,null,"T",null,null,null,"T"]
[null,null,"Sk",null,null,null,"Sk",null,null,null,"Sk",null,null,null,"Sk"]
[null,"PLEASE DO NOT USE CUT & PASTE or COPY & PASTE on this Sheet. "]
[null,{"$f":"(COUNTIF(B5:B39,\"*\")-7)","v":0},null,{"$f":"COUNTIF(D6:D39,\"*\")","v":0},null,{"$f":"(COUNTIF(F5:F39,\"*\")-7)","v":0},null,{"$f":"COUNTIF(H6:H39,\"*\")","v":0},null,{"$f":"(COUNTIF(J5:J39,\"*\")-7)","v":0},null,{"$f":"COUNTIF(L6:L39,\"*\")","v":0},null,{"$f":"(COUNTIF(N5:N39,\"*\")-7)","v":0},null,{"$f":"COUNTIF(P6:P39,\"*\")","v":0}]
[]
[null,"Bowlers"]
[null,"Column1"]
[null,{"$f":"Entries!B7","v":"A CONNOR"}]
[null,{"$f":"Entries!B8","v":"E. SHEPHERD"}]
[null,{"$f":"Entries!B9","v":"L. BOSHIER"}]
[null,{"$f":"Entries!B10","v":"B. CROWLEY"}]
[null,{"$f":"Entries!B11","v":"A. MOORE"}]
[null,{"$f":"Entries!B12","v":"D. COLEMAN"}]
[null,{"$f":"Entries!B13","v":"A. LAMB"}]
[null,{"$f":"Entries!B14","v":"R. SOUTH"}]
[null,{"$f":"Entries!B15","v":"E. JONES"}]
[null,{"$f":"Entries!B16","v":"J. HAYDEN"}]
[null,{"$f":"Entries!B17","v":"J. NEELY"}]
[null,{"$f":"Entries!B18","v":0}]
[null,{"$f":"Entries!B19","v":0}]
[null,{"$f":"Entries!B20","v":0}]
[null,{"$f":"Entries!B21","v":0}]
[null,{"$f":"Entries!B22","v":0}]
[null,{"$f":"Entries!E7","v":"B. CLAYTON"}]
[null,{"$f":"Entries!E8","v":"A. McGHEE"}]
[null,{"$f":"Entries!E9","v":"B. PORTER"}]
[null,{"$f":"Entries!E10","v":"E. HALL"}]
[null,{"$f":"Entries!E11","v":"T. BUTT"}]
[null,{"$f":"Entries!E12","v":"E. BROWN"}]
[null,{"$f":"Entries!E13","v":"C. SPILKER"}]
[null,{"$f":"Entries!E14","v":"N. BOYERS"}]
[null,{"$f":"Entries!E15","v":"B. EDWARDS"}]
[null,{"$f":"Entries!E16","v":"K.STAFFORD"}]
[null,{"$f":"Entries!E17","v":"G. FRASER"}]
[null,{"$f":"Entries!E18","v":0}]
[null,{"$f":"Entries!E19","v":0}]
[null,{"$f":"Entries!E20","v":0}]
[null,{"$f":"Entries!E21","v":0}]
[null,{"$f":"Entries!E22","v":0}]

{"sheet":"CARDS","index":9,"n_rows":667,"n_cols":16,"rows_kept":667,"cut":false,"hidden":false,"merged":[[643,0,643,11],[643,12,643,23],[639,0,639,10],[639,13,639,23],[641,0,641,10],[641,13,641,23],[641,11,641,12],[635,0,635,10],[635,11,635,12],[635,13,635,23],[638,2,638,8],[638,15,638,21],[637,2,637,8],[637,15,637,21],[633,0,633,10],[633,11,633,12],[627,2,627,6],[627,8,627,23],[629,0,629,10],[629,11,629,12],[629,13,629,23],[631,0,631,10],[631,11,631,12],[631,13,631,23],[633,13,633,23],[618,0,618,10],[618,13,618,23],[618,11,618,12],[620,0,620,11],[620,12,620,23],[621,0,621,23],[623,0,623,23],[625,2,625,6],[625,8,625,23],[612,0,612,10],[612,11,612,12],[612,13,612,23],[614,2,614,8],[614,15,614,21],[615,2,615,8],[615,15,615,21],[616,0,616,10],[616,13,616,23],[604,2,604,6],[604,8,604,23],[606,0,606,10],[606,11,606,12],[606,13,606,23],[608,0,608,10],[608,11,608,12],[608,13,608,23],[610,0,610,10],[610,11,610,12],[610,13,610,23],[595,0,595,10],[595,13,595,23],[595,11,595,12],[597,0,597,11],[597,12,597,23],[598,0,598,23],[600,0,600,23],[602,2,602,6],[602,8,602,23],[589,0,589,10],[589,11,589,12],[589,13,589,23],[591,2,591,8],[591,15,591,21],[592,2,592,8],[592,15,592,21],[593,0,593,10],[593,13,593,23],[581,2,581,6],[581,8,581,23],[583,0,583,10],[583,11,583,12],[583,13,583,23],[585,0,585,10],[585,11,585,12],[585,13,585,23],[587,0,587,10],[587,11,587,12],[587,13,587,23],[572,0,572,10],[572,13,572,23],[572,11,572,12],[574,0,574,11],[574,12,574,23],[575,0,575,23],[577,0,577,23],[579,2,579,6],[579,8,579,23],[566,0,566,10],[566,11,566,12],[566,13,566,23],[568,2,568,8],[568,15,568,21],[569,2,569,8],[569,15,569,21],[570,0,570,10],[570,13,570,23],[558,2,558,6],[558,8,558,23],[560,0,560,10],[560,11,560,12],[560,13,560,23],[562,0,562,10],[562,11,562,12],[562,13,562,23],[564,0,564,10],[564,11,564,12],[564,13,564,23],[549,0,549,10],[549,13,549,23],[549,11,549,12],[551,0,551,11],[551,12,551,23],[552,0,552,23],[554,0,554,23],[556,2,556,6],[556,8,556,23],[543,0,543,10],[543,11,543,12],[543,13,543,23],[545,2,545,8],[545,15,545,21],[546,2,546,8],[546,15,546,21],[547,0,547,10],[547,13,547,23],[535,2,535,6],[535,8,535,23],[537,0,537,10],[537,11,537,12],[537,13,537,23],[539,0,539,10],[539,11,539,12],[539,13,539,23],[541,0,541,10],[541,11,541,12],[541,13,541,23],[526,0,526,10],[526,13,526,23],[526,11,526,12],[528,0,528,11],[528,12,528,23],[529,0,529,23],[531,0,531,23],[533,2,533,6],[533,8,533,23],[520,0,520,10],[520,11,520,12],[520,13,520,23],[522,2,522,8],[522,15,522,21],[523,2,523,8],[523,15,523,21],[524,0,524,10],[524,13,524,23],[512,2,512,6],[512,8,512,23],[514,0,514,10],[514,11,514,12],[514,13,514,23],[516,0,516,10],[516,11,516,12],[516,13,516,23],[518,0,518,10],[518,11,518,12],[518,13,518,23],[503,0,503,10],[503,13,503,23],[503,11,503,12],[505,0,505,11],[505,12,505,23],[506,0,506,23],[508,0,508,23],[510,2,510,6],[510,8,510,23],[497,0,497,10],[497,11,497,12],[497,13,497,23],[499,2,499,8],[499,15,499,21],[500,2,500,8],[500,15,500,21],[501,0,501,10],[501,13,501,23],[489,2,489,6],[489,8,489,23],[491,0,491,10],[491,11,491,12],[491,13,491,23],[493,0,493,10],[493,11,493,12],[493,13,493,23],[495,0,495,10],[495,11,495,12],[495,13,495,23],[480,0,480,10],[480,13,480,23],[480,11,480,12],[482,0,482,11],[482,12,482,23],[483,0,483,23],[485,0,485,23],[487,2,487,6],[487,8,487,23],[474,0,474,10],[474,11,474,12],[474,13,474,23],[476,2,476,8],[476,15,476,21],[477,2,477,8],[477,15,477,21],[478,0,478,10],[478,13,478,23],[466,2,466,6],[466,8,466,23],[468,0,468,10],[468,11,468,12],[468,13,468,23],[470,0,470,10],[470,11,470,12],[470,13,470,23],[472,0,472,10],[472,11,472,12],[472,13,472,23],[457,0,457,10],[457,13,457,23],[457,11,457,12],[459,0,459,11],[459,12,459,23],[460,0,460,23],[462,0,462,23],[464,2,464,6],[464,8,464,23],[451,0,451,10],[451,11,451,12],[451,13,451,23],[453,2,453,8],[453,15,453,21],[454,2,454,8],[454,15,454,21],[455,0,455,10],[455,13,455,23],[443,2,443,6],[443,8,443,23],[445,0,445,10],[445,11,445,12],[445,13,445,23],[447,0,447,10],[447,11,447,12],[447,13,447,23],[449,0,449,10],[449,11,449,12],[449,13,449,23],[434,0,434,10],[434,13,434,23],[434,11,434,12],[436,0,436,11],[436,12,436,23],[437,0,437,23],[439,0,439,23],[441,2,441,6],[441,8,441,23],[428,0,428,10],[428,11,428,12],[428,13,428,23],[430,2,430,8],[430,15,430,21],[431,2,431,8],[431,15,431,21],[432,0,432,10],[432,13,432,23],[420,2,420,6],[420,8,420,23],[422,0,422,10],[422,11,422,12],[422,13,422,23],[424,0,424,10],[424,11,424,12],[424,13,424,23],[426,0,426,10],[426,11,426,12],[426,13,426,23],[411,0,411,10],[411,13,411,23],[411,11,411,12],[413,0,413,11],[413,12,413,23],[414,0,414,23],[416,0,416,23],[418,2,418,6],[418,8,418,23],[405,0,405,10],[405,11,405,12],[405,13,405,23],[407,2,407,8],[407,15,407,21],[408,2,408,8],[408,15,408,21],[409,0,409,10],[409,13,409,23],[397,2,397,6],[397,8,397,23],[399,0,399,10],[399,11,399,12],[399,13,399,23],[401,0,401,10],[401,11,401,12],[401,13,401,23],[403,0,403,10],[403,11,403,12],[403,13,403,23],[388,0,388,10],[388,13,388,23],[388,11,388,12],[390,0,390,11],[390,12,390,23],[391,0,391,23],[393,0,393,23],[395,2,395,6],[395,8,395,23],[382,0,382,10],[382,11,382,12],[382,13,382,23],[384,2,384,8],[384,15,384,21],[385,2,385,8],[385,15,385,21],[386,0,386,10],[386,13,386,23],[374,2,374,6],[374,8,374,23],[376,0,376,10],[376,11,376,12],[376,13,376,23],[378,0,378,10],[378,11,378,12],[378,13,378,23],[380,0,380,10],[380,11,380,12],[380,13,380,23],[365,0,365,10],[365,13,365,23],[365,11,365,12],[367,0,367,11],[367,12,367,23],[368,0,368,23],[370,0,370,23],[372,2,372,6],[372,8,372,23],[359,0,359,10],[359,11,359,12],[359,13,359,23],[361,2,361,8],[361,15,361,21],[362,2,362,8],[362,15,362,21],[363,0,363,10],[363,13,363,23],[351,2,351,6],[351,8,351,23],[353,0,353,10],[353,11,353,12],[353,13,353,23],[355,0,355,10],[355,11,355,12],[355,13,355,23],[357,0,357,10],[357,11,357,12],[357,13,357,23],[342,0,342,10],[342,13,342,23],[342,11,342,12],[344,0,344,11],[344,12,344,23],[345,0,345,23],[347,0,347,23],[349,2,349,6],[349,8,349,23],[336,0,336,10],[336,11,336,12],[336,13,336,23],[338,2,338,8],[338,15,338,21],[339,2,339,8],[339,15,339,21],[340,0,340,10],[340,13,340,23],[328,2,328,6],[328,8,328,23],[330,0,330,10],[330,11,330,12],[330,13,330,23],[332,0,332,10],[332,11,332,12],[332,13,332,23],[334,0,334,10],[334,11,334,12],[334,13,334,23],[319,0,319,10],[319,13,319,23],[319,11,319,12],[321,0,321,11],[321,12,321,23],[322,0,322,23],[324,0,324,23],[326,2,326,6],[326,8,326,23],[313,0,313,10],[313,11,313,12],[313,13,313,23],[315,2,315,8],[315,15,315,21],[316,2,316,8],[316,15,316,21],[317,0,317,10],[317,13,317,23],[305,2,305,6],[305,8,305,23],[307,0,307,10],[307,11,307,12],[307,13,307,23],[309,0,309,10],[309,11,309,12],[309,13,309,23],[311,0,311,10],[311,11,311,12],[311,13,311,23],[296,0,296,10],[296,13,296,23],[296,11,296,12],[298,0,298,11],[298,12,298,23],[299,0,299,23],[301,0,301,23],[303,2,303,6],[303,8,303,23],[290,0,290,10],[290,11,290,12],[290,13,290,23],[292,2,292,8],[292,15,292,21],[293,2,293,8],[293,15,293,21],[294,0,294,10],[294,13,294,23],[282,2,282,6],[282,8,282,23],[284,0,284,10],[284,11,284,12],[284,13,284,23],[286,0,286,10],[286,11,286,12],[286,13,286,23],[288,0,288,10],[288,11,288,12],[288,13,288,23],[273,0,273,10],[273,13,273,23],[273,11,273,12],[275,0,275,11],[275,12,275,23],[276,0,276,23],[278,0,278,23],[280,2,280,6],[280,8,280,23],[267,0,267,10],[267,11,267,12],[267,13,267,23],[269,2,269,8],[269,15,269,21],[270,2,270,8],[270,15,270,21],[271,0,271,10],[271,13,271,23],[259,2,259,6],[259,8,259,23],[261,0,261,10],[261,11,261,12],[261,13,261,23],[263,0,263,10],[263,11,263,12],[263,13,263,23],[265,0,265,10],[265,11,265,12],[265,13,265,23],[250,0,250,10],[250,13,250,23],[250,11,250,12],[252,0,252,11],[252,12,252,23],[253,0,253,23],[255,0,255,23],[257,2,257,6],[257,8,257,23],[244,0,244,10],[244,11,244,12],[244,13,244,23],[246,2,246,8],[246,15,246,21],[247,2,247,8],[247,15,247,21],[248,0,248,10],[248,13,248,23],[236,2,236,6],[236,8,236,23],[238,0,238,10],[238,11,238,12],[238,13,238,23],[240,0,240,10],[240,11,240,12],[240,13,240,23],[242,0,242,10],[242,11,242,12],[242,13,242,23],[227,0,227,10],[227,13,227,23],[227,11,227,12],[229,0,229,11],[229,12,229,23],[230,0,230,23],[232,0,232,23],[234,2,234,6],[234,8,234,23],[221,0,221,10],[221,11,221,12],[221,13,221,23],[223,2,223,8],[223,15,223,21],[224,2,224,8],[224,15,224,21],[225,0,225,10],[225,13,225,23],[213,2,213,6],[213,8,213,23],[215,0,215,10],[215,11,215,12],[215,13,215,23],[217,0,217,10],[217,11,217,12],[217,13,217,23],[219,0,219,10],[219,11,219,12],[219,13,219,23],[204,0,204,10],[204,13,204,23],[204,11,204,12],[206,0,206,11],[206,12,206,23],[207,0,207,23],[209,0,209,23],[211,2,211,6],[211,8,211,23],[198,0,198,10],[198,11,198,12],[198,13,198,23],[200,2,200,8],[200,15,200,21],[201,2,201,8],[201,15,201,21],[202,0,202,10],[202,13,202,23],[190,2,190,6],[190,8,190,23],[192,0,192,10],[192,11,192,12],[192,13,192,23],[194,0,194,10],[194,11,194,12],[194,13,194,23],[196,0,196,10],[196,11,196,12],[196,13,196,23],[181,0,181,10],[181,13,181,23],[181,11,181,12],[183,0,183,11],[183,12,183,23],[184,0,184,23],[186,0,186,23],[188,2,188,6],[188,8,188,23],[175,0,175,10],[175,11,175,12],[175,13,175,23],[177,2,177,8],[177,15,177,21],[178,2,178,8],[178,15,178,21],[179,0,179,10],[179,13,179,23],[167,2,167,6],[167,8,167,23],[169,0,169,10],[169,11,169,12],[169,13,169,23],[171,0,171,10],[171,11,171,12],[171,13,171,23],[173,0,173,10],[173,11,173,12],[173,13,173,23],[158,0,158,10],[158,13,158,23],[158,11,158,12],[160,0,160,11],[160,12,160,23],[161,0,161,23],[163,0,163,23],[165,2,165,6],[165,8,165,23],[152,0,152,10],[152,11,152,12],[152,13,152,23],[154,2,154,8],[154,15,154,21],[155,2,155,8],[155,15,155,21],[156,0,156,10],[156,13,156,23],[144,2,144,6],[144,8,144,23],[146,0,146,10],[146,11,146,12],[146,13,146,23],[148,0,148,10],[148,11,148,12],[148,13,148,23],[150,0,150,10],[150,11,150,12],[150,13,150,23],[135,0,135,10],[135,13,135,23],[135,11,135,12],[137,0,137,11],[137,12,137,23],[138,0,138,23],[140,0,140,23],[142,2,142,6],[142,8,142,23],[129,0,129,10],[129,11,129,12],[129,13,129,23],[131,2,131,8],[131,15,131,21],[132,2,132,8],[132,15,132,21],[133,0,133,10],[133,13,133,23],[121,2,121,6],[121,8,121,23],[123,0,123,10],[123,11,123,12],[123,13,123,23],[125,0,125,10],[125,11,125,12],[125,13,125,23],[127,0,127,10],[127,11,127,12],[127,13,127,23],[112,0,112,10],[112,13,112,23],[112,11,112,12],[114,0,114,11],[114,12,114,23],[115,0,115,23],[117,0,117,23],[119,2,119,6],[119,8,119,23],[106,0,106,10],[106,11,106,12],[106,13,106,23],[108,2,108,8],[108,15,108,21],[109,2,109,8],[109,15,109,21],[110,0,110,10],[110,13,110,23],[98,2,98,6],[98,8,98,23],[100,0,100,10],[100,11,100,12],[100,13,100,23],[102,0,102,10],[102,11,102,12],[102,13,102,23],[104,0,104,10],[104,11,104,12],[104,13,104,23],[87,0,87,10],[87,13,87,23],[89,0,89,10],[89,13,89,23],[91,0,91,11],[91,12,91,23],[92,0,92,23],[94,0,94,23],[96,2,96,6],[96,8,96,23],[81,0,81,10],[81,11,81,12],[81,13,81,23],[83,0,83,10],[83,11,83,12],[83,13,83,23],[85,2,85,8],[85,15,85,21],[86,2,86,8],[86,15,86,21],[71,0,71,23],[73,2,73,6],[73,8,73,23],[75,2,75,6],[75,8,75,23],[77,0,77,10],[77,11,77,12],[77,13,77,23],[79,0,79,10],[79,11,79,12],[79,13,79,23],[63,2,63,8],[63,15,63,21],[64,0,64,10],[64,13,64,23],[66,0,66,10],[66,13,66,23],[68,0,68,11],[68,12,68,23],[69,0,69,23],[14,0,14,10],[27,8,27,23],[29,2,29,6],[23,0,23,23],[29,8,29,23],[52,8,52,23],[54,0,54,10],[54,11,54,12],[54,13,54,23],[18,13,18,23],[33,0,33,10],[33,11,33,12],[33,13,33,23],[25,0,25,23],[27,2,27,6],[22,12,22,23],[31,0,31,10],[31,11,31,12],[0,0,0,23],[2,0,2,23],[4,2,4,6],[20,0,20,10],[20,13,20,23],[17,2,17,8],[6,2,6,6],[6,8,6,23],[10,11,10,12],[10,13,10,23],[12,0,12,10],[12,11,12,12],[12,13,12,23],[16,2,16,8],[4,8,4,23],[8,0,8,10],[8,11,8,12],[8,13,8,23],[10,0,10,10],[17,15,17,21],[16,15,16,21],[14,11,14,12],[14,13,14,23],[18,0,18,10],[20,11,20,12],[43,11,43,12],[66,11,66,12],[89,11,89,12],[22,0,22,11],[35,0,35,10],[35,11,35,12],[35,13,35,23],[37,0,37,10],[37,11,37,12],[37,13,37,23],[39,2,39,8],[39,15,39,21],[40,2,40,8],[40,15,40,21],[41,0,41,10],[41,13,41,23],[43,0,43,10],[43,13,43,23],[31,13,31,23],[56,0,56,10],[56,11,56,12],[56,13,56,23],[58,0,58,10],[658,0,658,10],[658,11,658,12],[658,13,658,23],[660,2,660,8],[660,15,660,21],[654,0,654,10],[654,11,654,12],[654,13,654,23],[656,0,656,10],[656,13,656,23],[650,2,650,6],[650,8,650,23],[652,0,652,10],[652,11,652,12],[652,13,652,23],[656,11,656,12],[45,0,45,11],[45,12,45,23],[46,0,46,23],[48,0,48,23],[50,2,50,6],[50,8,50,23],[52,2,52,6],[644,0,644,23],[646,0,646,23],[648,2,648,6],[648,8,648,23],[58,11,58,12],[58,13,58,23],[60,0,60,10],[60,11,60,12],[60,13,60,23],[62,2,62,8],[62,15,62,21],[664,0,664,10],[664,11,664,12],[664,13,664,23],[666,0,666,11],[666,12,666,23],[661,2,661,8],[661,15,661,21],[662,0,662,10],[662,13,662,23]]}
[{"$f":"TEAMS!$D$1","v":"CLUB NAME"}]
[]
[{"$f":"TEAMS!$D$3","v":"Tuesday Mens Mufti."}]
[]
[null,null,"RINK",null,null,null,null,null,"DATE"]
[]
[null,null,{"$f":"TEAMS!$C$5","v":0},null,null,null,null,null,{"$f":"TEAMS!$D$2","v":"2011-03-07"}]
[]
[{"$f":"TEAMS!$B$6","v":0},null,null,null,null,null,null,null,null,null,null,"L",null,{"$f":"TEAMS!$D$6","v":0}]
[]
[{"$f":"TEAMS!$B$7","v":0},null,null,null,null,null,null,null,null,null,null,"S",null,{"$f":"TEAMS!$D$7","v":0}]
[]
[{"$f":"TEAMS!$B$8","v":0},null,null,null,null,null,null,null,null,null,null,"T",null,{"$f":"TEAMS!$D$8","v":0}]
[]
[{"$f":"TEAMS!$B$9","v":0},null,null,null,null,null,null,null,null,null,null,"Sk",null,{"$f":"TEAMS!$D$9","v":0}]
[]
[1,null,"TOTAL SCORE",null,null,null,null,null,null,null,null,null,null,null,null,"TOTAL SCORE"]
[]
["Signature",null,null,null,null,null,null,null,null,null,null,null,null,"Signature"]
[]
[null,null,null,null,null,null,null,null,null,null,null,1]
[]
["Time Match Completed:-"]
[{"$f":"TEAMS!$D$1","v":"CLUB NAME"}]
[]
[{"$f":"TEAMS!$D$3","v":"Tuesday Mens Mufti."}]
[]
[null,null,"RINK",null,null,null,null,null,"DATE"]
[]
[null,null,{"$f":"TEAMS!$C$10","v":0},null,null,null,null,null,{"$f":"TEAMS!$D$2","v":"2011-03-07"}]
[]
[{"$f":"TEAMS!$B$11","v":0},null,null,null,null,null,null,null,null,null,null,"L",null,{"$f":"TEAMS!$D$11","v":0}]
[]
[{"$f":"TEAMS!$B$12","v":0},null,null,null,null,null,null,null,null,null,null,"S",null,{"$f":"TEAMS!$D$12","v":0}]
[]
[{"$f":"TEAMS!$B$13","v":0},null,null,null,null,null,null,null,null,null,null,"T",null,{"$f":"TEAMS!$D$13","v":0}]
[]
[{"$f":"TEAMS!$B$14","v":0},null,null,null,null,null,null,null,null,null,null,"Sk",null,{"$f":"TEAMS!$D$14","v":0}]
[]
[1,null,"TOTAL SCORE",null,null,null,null,null,null,null,null,null,null,null,null,"TOTAL SCORE"]
[]
["Signature",null,null,null,null,null,null,null,null,null,null,null,null,"Signature"]
[]
[null,null,null,null,null,null,null,null,null,null,null,2]
[]
["Time Match Completed:-"]
[{"$f":"TEAMS!$D$1","v":"CLUB NAME"}]
[]
[{"$f":"TEAMS!$D$3","v":"Tuesday Mens Mufti."}]
[]
[null,null,"RINK",null,null,null,null,null,"DATE"]
[]
[null,null,{"$f":"TEAMS!$C$15","v":0},null,null,null,null,null,{"$f":"TEAMS!$D$2","v":"2011-03-07"}]
[]
[{"$f":"TEAMS!$B$16","v":0},null,null,null,null,null,null,null,null,null,null,"L",null,{"$f":"TEAMS!$D$16","v":0}]
[]
[{"$f":"TEAMS!$B$17","v":0},null,null,null,null,null,null,null,null,null,null,"S",null,{"$f":"TEAMS!$D$17","v":0}]
[]
[{"$f":"TEAMS!$B$18","v":0},null,null,null,null,null,null,null,null,null,null,"T",null,{"$f":"TEAMS!$D$18","v":0}]
[]
[{"$f":"TEAMS!$B$19","v":0},null,null,null,null,null,null,null,null,null,null,"Sk",null,{"$f":"TEAMS!$D$19","v":0}]
[]
[1,null,"TOTAL SCORE",null,null,null,null,null,null,null,null,null,null,null,null,"TOTAL SCORE"]
[]
["Signature",null,null,null,null,null,null,null,null,null,null,null,null,"Signature"]
[]
[null,null,null,null,null,null,null,null,null,null,null,3]
[]
["Time Match Completed:-"]
[{"$f":"TEAMS!$D$1","v":"CLUB NAME"}]
[]
[{"$f":"TEAMS!$D$3","v":"Tuesday Mens Mufti."}]
[]
[null,null,"RINK",null,null,null,null,null,"DATE"]
[]
[null,null,{"$f":"TEAMS!$C$20","v":0},null,null,null,null,null,{"$f":"TEAMS!$D$2","v":"2011-03-07"}]
[]
[{"$f":"TEAMS!$B$21","v":0},null,null,null,null,null,null,null,null,null,null,"L",null,{"$f":"TEAMS!$D$21","v":0}]
[]
[{"$f":"TEAMS!$B$22","v":0},null,null,null,null,null,null,null,null,null,null,"S",null,{"$f":"TEAMS!$D$22","v":0}]
[]
[{"$f":"TEAMS!$B$23","v":0},null,null,null,null,null,null,null,null,null,null,"T",null,{"$f":"TEAMS!$D$23","v":0}]
[]
[{"$f":"TEAMS!$B$24","v":0},null,null,null,null,null,null,null,null,null,null,"Sk",null,{"$f":"TEAMS!$D$24","v":0}]
[]
[1,null,"TOTAL SCORE",null,null,null,null,null,null,null,null,null,null,null,null,"TOTAL SCORE"]
[]
["Signature",null,null,null,null,null,null,null,null,null,null,null,null,"Signature"]
[]
[null,null,null,null,null,null,null,null,null,null,null,4]
[]
["Time Match Completed:-"]
[{"$f":"TEAMS!$D$1","v":"CLUB NAME"}]
[]
[{"$f":"TEAMS!$D$3","v":"Tuesday Mens Mufti."}]
[]
[null,null,"RINK",null,null,null,null,null,"DATE"]
[]
[null,null,{"$f":"TEAMS!$C$25","v":0},null,null,null,null,null,{"$f":"TEAMS!$D$2","v":"2011-03-07"}]
[]
[{"$f":"TEAMS!$B$26","v":0},null,null,null,null,null,null,null,null,null,null,"L",null,{"$f":"TEAMS!$D$26","v":0}]
[]
[{"$f":"TEAMS!$B$27","v":0},null,null,null,null,null,null,null,null,null,null,"S",null,{"$f":"TEAMS!$D$27","v":0}]
[]
[{"$f":"TEAMS!$B$28","v":0},null,null,null,null,null,null,null,null,null,null,"T",null,{"$f":"TEAMS!$D$28","v":0}]
[]
[{"$f":"TEAMS!$B$29","v":0},null,null,null,null,null,null,null,null,null,null,"Sk",null,{"$f":"TEAMS!$D$29","v":0}]
[]
[1,null,"TOTAL SCORE",null,null,null,null,null,null,null,null,null,null,null,null,"TOTAL SCORE"]
[]
["Signature",null,null,null,null,null,null,null,null,null,null,null,null,"Signature"]
[]
[null,null,null,null,null,null,null,null,null,null,null,5]
[]
["Time Match Completed:-"]
[{"$f":"TEAMS!$D$1","v":"CLUB NAME"}]
[]
[{"$f":"TEAMS!$D$3","v":"Tuesday Mens Mufti."}]
[]
[null,null,"RINK",null,null,null,null,null,"DATE"]
[]
[null,null,{"$f":"TEAMS!$C$30","v":0},null,null,null,null,null,{"$f":"TEAMS!$D$2","v":"2011-03-07"}]
[]
[{"$f":"TEAMS!$B$31","v":0},null,null,null,null,null,null,null,null,null,null,"L",null,{"$f":"TEAMS!$D$31","v":0}]
[]
[{"$f":"TEAMS!$B$32","v":0},null,null,null,null,null,null,null,null,null,null,"S",null,{"$f":"TEAMS!$D$32","v":0}]
[]
[{"$f":"TEAMS!$B$33","v":0},null,null,null,null,null,null,null,null,null,null,"T",null,{"$f":"TEAMS!$D$33","v":0}]
[]
[{"$f":"TEAMS!$B$34","v":0},null,null,null,null,null,null,null,null,null,null,"Sk",null,{"$f":"TEAMS!$D$34","v":0}]
[]
[1,null,"TOTAL SCORE",null,null,null,null,null,null,null,null,null,null,null,null,"TOTAL SCORE"]
[]
["Signature",null,null,null,null,null,null,null,null,null,null,null,null,"Signature"]
[]
[null,null,null,null,null,null,null,null,null,null,null,6]
[]
["Time Match Completed:-"]
[{"$f":"TEAMS!$D$1","v":"CLUB NAME"}]
[]
[{"$f":"TEAMS!$D$3","v":"Tuesday Mens Mufti."}]
[]
[null,null,"RINK",null,null,null,null,null,"DATE"]
[]
[null,null,{"$f":"TEAMS!$C$35","v":0},null,null,null,null,null,{"$f":"TEAMS!$D$2","v":"2011-03-07"}]
[]
[{"$f":"TEAMS!$B$36","v":0},null,null,null,null,null,null,null,null,null,null,"L",null,{"$f":"TEAMS!$D$36","v":0}]
[]
[{"$f":"TEAMS!$B$37","v":0},null,null,null,null,null,null,null,null,null,null,"S",null,{"$f":"TEAMS!$D$37","v":0}]
[]
[{"$f":"TEAMS!$B$38","v":0},null,null,null,null,null,null,null,null,null,null,"T",null,{"$f":"TEAMS!$D$38","v":0}]
[]
[{"$f":"TEAMS!$B$39","v":0},null,null,null,null,null,null,null,null,null,null,"Sk",null,{"$f":"TEAMS!$D$39","v":0}]
[]
[1,null,"TOTAL SCORE",null,null,null,null,null,null,null,null,null,null,null,null,"TOTAL SCORE"]
[]
["Signature",null,null,null,null,null,null,null,null,null,null,null,null,"Signature"]
[]
[null,null,null,null,null,null,null,null,null,null,null,7]
[]
["Time Match Completed:-"]
[{"$f":"TEAMS!$D$1","v":"CLUB NAME"}]
[]
[{"$f":"TEAMS!$D$3","v":"Tuesday Mens Mufti."}]
[]
[null,null,"RINK",null,null,null,null,null,"DATE"]
[]
[null,null,{"$f":"TEAMS!$G$5","v":0},null,null,null,null,null,{"$f":"TEAMS!$D$2","v":"2011-03-07"}]
[]
[{"$f":"TEAMS!$F$6","v":0},null,null,null,null,null,null,null,null,null,null,"L",null,{"$f":"TEAMS!$H$6","v":0}]
[]
[{"$f":"TEAMS!$F$7","v":0},null,null,null,null,null,null,null,null,null,null,"S",null,{"$f":"TEAMS!$H$7","v":0}]
[]
[{"$f":"TEAMS!$F$8","v":0},null,null,null,null,null,null,null,null,null,null,"T",null,{"$f":"TEAMS!$H$8","v":0}]
[]
[{"$f":"TEAMS!$F$9","v":0},null,null,null,null,null,null,null,null,null,null,"Sk",null,{"$f":"TEAMS!$H$9","v":0}]
[]
[1,null,"TOTAL SCORE",null,null,null,null,null,null,null,null,null,null,null,null,"TOTAL SCORE"]
[]
["Signature",null,null,null,null,null,null,null,null,null,null,null,null,"Signature"]
[]
[null,null,null,null,null,null,null,null,null,null,null,8]
[]
["Time Match Completed:-"]
[{"$f":"TEAMS!$D$1","v":"CLUB NAME"}]
[]
[{"$f":"TEAMS!$D$3","v":"Tuesday Mens Mufti."}]
[]
[null,null,"RINK",null,null,null,null,null,"DATE"]
[]
[null,null,{"$f":"TEAMS!$G$10","v":0},null,null,null,null,null,{"$f":"TEAMS!$D$2","v":"2011-03-07"}]
[]
[{"$f":"TEAMS!$F$11","v":0},null,null,null,null,null,null,null,null,null,null,"L",null,{"$f":"TEAMS!$H$11","v":0}]
[]
[{"$f":"TEAMS!$F$12","v":0},null,null,null,null,null,null,null,null,null,null,"S",null,{"$f":"TEAMS!$H$12","v":0}]
[]
[{"$f":"TEAMS!$F$13","v":0},null,null,null,null,null,null,null,null,null,null,"T",null,{"$f":"TEAMS!$H$13","v":0}]
[]
[{"$f":"TEAMS!$F$14","v":0},null,null,null,null,null,null,null,null,null,null,"Sk",null,{"$f":"TEAMS!$H$14","v":0}]
[]
[1,null,"TOTAL SCORE",null,null,null,null,null,null,null,null,null,null,null,null,"TOTAL SCORE"]
[]
["Signature",null,null,null,null,null,null,null,null,null,null,null,null,"Signature"]
[]
[null,null,null,null,null,null,null,null,null,null,null,9]
[]
["Time Match Completed:-"]
[{"$f":"TEAMS!$D$1","v":"CLUB NAME"}]
[]
[{"$f":"TEAMS!$D$3","v":"Tuesday Mens Mufti."}]
[]
[null,null,"RINK",null,null,null,null,null,"DATE"]
[]
[null,null,{"$f":"TEAMS!$G$15","v":0},null,null,null,null,null,{"$f":"TEAMS!$D$2","v":"2011-03-07"}]
[]
[{"$f":"TEAMS!$F$16","v":0},null,null,null,null,null,null,null,null,null,null,"L",null,{"$f":"TEAMS!$H$16","v":0}]
[]
[{"$f":"TEAMS!$F$17","v":0},null,null,null,null,null,null,null,null,null,null,"S",null,{"$f":"TEAMS!$H$17","v":0}]
[]
[{"$f":"TEAMS!$F$18","v":0},null,null,null,null,null,null,null,null,null,null,"T",null,{"$f":"TEAMS!$H$18","v":0}]
[]
[{"$f":"TEAMS!$F$19","v":0},null,null,null,null,null,null,null,null,null,null,"Sk",null,{"$f":"TEAMS!$H$19","v":0}]
[]
[1,null,"TOTAL SCORE",null,null,null,null,null,null,null,null,null,null,null,null,"TOTAL SCORE"]
[]
["Signature",null,null,null,null,null,null,null,null,null,null,null,null,"Signature"]
[]
[null,null,null,null,null,null,null,null,null,null,null,10]
[]
["Time Match Completed:-"]
[{"$f":"TEAMS!$D$1","v":"CLUB NAME"}]
[]
[{"$f":"TEAMS!$D$3","v":"Tuesday Mens Mufti."}]
[]
[null,null,"RINK",null,null,null,null,null,"DATE"]
[]
[null,null,{"$f":"TEAMS!$G$20","v":0},null,null,null,null,null,{"$f":"TEAMS!$D$2","v":"2011-03-07"}]
[]
[{"$f":"TEAMS!$F$21","v":0},null,null,null,null,null,null,null,null,null,null,"L",null,{"$f":"TEAMS!$H$21","v":0}]
[]
[{"$f":"TEAMS!$F$22","v":0},null,null,null,null,null,null,null,null,null,null,"S",null,{"$f":"TEAMS!$H$22","v":0}]
[]
[{"$f":"TEAMS!$F$23","v":0},null,null,null,null,null,null,null,null,null,null,"T",null,{"$f":"TEAMS!$H$23","v":0}]
[]
[{"$f":"TEAMS!$F$24","v":0},null,null,null,null,null,null,null,null,null,null,"Sk",null,{"$f":"TEAMS!$H$24","v":0}]
[]
[1,null,"TOTAL SCORE",null,null,null,null,null,null,null,null,null,null,null,null,"TOTAL SCORE"]
[]
["Signature",null,null,null,null,null,null,null,null,null,null,null,null,"Signature"]
[]
[null,null,null,null,null,null,null,null,null,null,null,11]
[]
["Time Match Completed:-"]
[{"$f":"TEAMS!$D$1","v":"CLUB NAME"}]
[]
[{"$f":"TEAMS!$D$3","v":"Tuesday Mens Mufti."}]
[]
[null,null,"RINK",null,null,null,null,null,"DATE"]
[]
[null,null,{"$f":"TEAMS!$G$25","v":0},null,null,null,null,null,{"$f":"TEAMS!$D$2","v":"2011-03-07"}]
[]
[{"$f":"TEAMS!$F$26","v":0},null,null,null,null,null,null,null,null,null,null,"L",null,{"$f":"TEAMS!$H$26","v":0}]
[]
[{"$f":"TEAMS!$F$27","v":0},null,null,null,null,null,null,null,null,null,null,"S",null,{"$f":"TEAMS!$H$27","v":0}]
[]
[{"$f":"TEAMS!$F$28","v":0},null,null,null,null,null,null,null,null,null,null,"T",null,{"$f":"TEAMS!$H$28","v":0}]
[]
[{"$f":"TEAMS!$F$29","v":0},null,null,null,null,null,null,null,null,null,null,"Sk",null,{"$f":"TEAMS!$H$29","v":0}]
[]
[1,null,"TOTAL SCORE",null,null,null,null,null,null,null,null,null,null,null,null,"TOTAL SCORE"]
[]
["Signature",null,null,null,null,null,null,null,null,null,null,null,null,"Signature"]
[]
[null,null,null,null,null,null,null,null,null,null,null,12]
[]
["Time Match Completed:-"]
[{"$f":"TEAMS!$D$1","v":"CLUB NAME"}]
[]
[{"$f":"TEAMS!$D$3","v":"Tuesday Mens Mufti."}]
[]
[null,null,"RINK",null,null,null,null,null,"DATE"]
[]
[null,null,{"$f":"TEAMS!$G$30","v":0},null,null,null,null,null,{"$f":"TEAMS!$D$2","v":"2011-03-07"}]
[]
[{"$f":"TEAMS!$F$31","v":0},null,null,null,null,null,null,null,null,null,null,"L",null,{"$f":"TEAMS!$H$31","v":0}]
[]
[{"$f":"TEAMS!$F$32","v":0},null,null,null,null,null,null,null,null,null,null,"S",null,{"$f":"TEAMS!$H$32","v":0}]
[]
[{"$f":"TEAMS!$F$33","v":0},null,null,null,null,null,null,null,null,null,null,"T",null,{"$f":"TEAMS!$H$33","v":0}]
[]
[{"$f":"TEAMS!$F$34","v":0},null,null,null,null,null,null,null,null,null,null,"Sk",null,{"$f":"TEAMS!$H$34","v":0}]
[]
[1,null,"TOTAL SCORE",null,null,null,null,null,null,null,null,null,null,null,null,"TOTAL SCORE"]
[]
["Signature",null,null,null,null,null,null,null,null,null,null,null,null,"Signature"]
[]
[null,null,null,null,null,null,null,null,null,null,null,13]
[]
["Time Match Completed:-"]
[{"$f":"TEAMS!$D$1","v":"CLUB NAME"}]
[]
[{"$f":"TEAMS!$D$3","v":"Tuesday Mens Mufti."}]
[]
[null,null,"RINK",null,null,null,null,null,"DATE"]
[]
[null,null,{"$f":"TEAMS!$G$35","v":0},null,null,null,null,null,{"$f":"TEAMS!$D$2","v":"2011-03-07"}]
[]
[{"$f":"TEAMS!$F$36","v":0},null,null,null,null,null,null,null,null,null,null,"L",null,{"$f":"TEAMS!$H$36","v":0}]
[]
[{"$f":"TEAMS!$F$37","v":0},null,null,null,null,null,null,null,null,null,null,"S",null,{"$f":"TEAMS!$H$37","v":0}]
[]
[{"$f":"TEAMS!$F$38","v":0},null,null,null,null,null,null,null,null,null,null,"T",null,{"$f":"TEAMS!$H$38","v":0}]
[]
[{"$f":"TEAMS!$F$39","v":0},null,null,null,null,null,null,null,null,null,null,"Sk",null,{"$f":"TEAMS!$H$39","v":0}]
[]
[1,null,"TOTAL SCORE",null,null,null,null,null,null,null,null,null,null,null,null,"TOTAL SCORE"]
[]
["Signature",null,null,null,null,null,null,null,null,null,null,null,null,"Signature"]
[]
[null,null,null,null,null,null,null,null,null,null,null,14]
[]
["Time Match Completed:-"]
[{"$f":"TEAMS!$D$1","v":"CLUB NAME"}]
[]
[{"$f":"TEAMS!$D$3","v":"Tuesday Mens Mufti."}]
[]
[null,null,"RINK",null,null,null,null,null,"DATE"]
[]
[null,null,{"$f":"TEAMS!$K$5","v":0},null,null,null,null,null,{"$f":"TEAMS!$D$2","v":"2011-03-07"}]
[]
[{"$f":"TEAMS!$J$6","v":0},null,null,null,null,null,null,null,null,null,null,"L",null,{"$f":"TEAMS!$L$6","v":0}]
[]
[{"$f":"TEAMS!$J$7","v":0},null,null,null,null,null,null,null,null,null,null,"S",null,{"$f":"TEAMS!$L$7","v":0}]
[]
[{"$f":"TEAMS!$J$8","v":0},null,null,null,null,null,null,null,null,null,null,"T",null,{"$f":"TEAMS!$L$8","v":0}]
[]
[{"$f":"TEAMS!$J$9","v":0},null,null,null,null,null,null,null,null,null,null,"Sk",null,{"$f":"TEAMS!$L$9","v":0}]
[]
[1,null,"TOTAL SCORE",null,null,null,null,null,null,null,null,null,null,null,null,"TOTAL SCORE"]
[]
["Signature",null,null,null,null,null,null,null,null,null,null,null,null,"Signature"]
[]
[null,null,null,null,null,null,null,null,null,null,null,15]
[]
["Time Match Completed:-"]
[{"$f":"TEAMS!$D$1","v":"CLUB NAME"}]
[]
[{"$f":"TEAMS!$D$3","v":"Tuesday Mens Mufti."}]
[]
[null,null,"RINK",null,null,null,null,null,"DATE"]
[]
[null,null,{"$f":"TEAMS!$K$10","v":0},null,null,null,null,null,{"$f":"TEAMS!$D$2","v":"2011-03-07"}]
[]
[{"$f":"TEAMS!$J$11","v":0},null,null,null,null,null,null,null,null,null,null,"L",null,{"$f":"TEAMS!$L$11","v":0}]
[]
[{"$f":"TEAMS!$J$12","v":0},null,null,null,null,null,null,null,null,null,null,"S",null,{"$f":"TEAMS!$L$12","v":0}]
[]
[{"$f":"TEAMS!$J$13","v":0},null,null,null,null,null,null,null,null,null,null,"T",null,{"$f":"TEAMS!$L$13","v":0}]
[]
[{"$f":"TEAMS!$J$14","v":0},null,null,null,null,null,null,null,null,null,null,"Sk",null,{"$f":"TEAMS!$L$14","v":0}]
[]
[1,null,"TOTAL SCORE",null,null,null,null,null,null,null,null,null,null,null,null,"TOTAL SCORE"]
[]
["Signature",null,null,null,null,null,null,null,null,null,null,null,null,"Signature"]
[]
[null,null,null,null,null,null,null,null,null,null,null,16]
[]
["Time Match Completed:-"]
[{"$f":"TEAMS!$D$1","v":"CLUB NAME"}]
[]
[{"$f":"TEAMS!$D$3","v":"Tuesday Mens Mufti."}]
[]
[null,null,"RINK",null,null,null,null,null,"DATE"]
[]
[null,null,{"$f":"TEAMS!$K$15","v":0},null,null,null,null,null,{"$f":"TEAMS!$D$2","v":"2011-03-07"}]
[]
[{"$f":"TEAMS!$J$16","v":0},null,null,null,null,null,null,null,null,null,null,"L",null,{"$f":"TEAMS!$L$16","v":0}]
[]
[{"$f":"TEAMS!$J$17","v":0},null,null,null,null,null,null,null,null,null,null,"S",null,{"$f":"TEAMS!$L$17","v":0}]
[]
[{"$f":"TEAMS!$J$18","v":0},null,null,null,null,null,null,null,null,null,null,"T",null,{"$f":"TEAMS!$L$18","v":0}]
[]
[{"$f":"TEAMS!$J$19","v":0},null,null,null,null,null,null,null,null,null,null,"Sk",null,{"$f":"TEAMS!$L$19","v":0}]
[]
[1,null,"TOTAL SCORE",null,null,null,null,null,null,null,null,null,null,null,null,"TOTAL SCORE"]
[]
["Signature",null,null,null,null,null,null,null,null,null,null,null,null,"Signature"]
[]
[null,null,null,null,null,null,null,null,null,null,null,17]
[]
["Time Match Completed:-"]
[{"$f":"TEAMS!$D$1","v":"CLUB NAME"}]
[]
[{"$f":"TEAMS!$D$3","v":"Tuesday Mens Mufti."}]
[]
[null,null,"RINK",null,null,null,null,null,"DATE"]
[]
[null,null,{"$f":"TEAMS!$K$20","v":0},null,null,null,null,null,{"$f":"TEAMS!$D$2","v":"2011-03-07"}]
[]
[{"$f":"TEAMS!$J$21","v":0},null,null,null,null,null,null,null,null,null,null,"L",null,{"$f":"TEAMS!$L$21","v":0}]
[]
[{"$f":"TEAMS!$J$22","v":0},null,null,null,null,null,null,null,null,null,null,"S",null,{"$f":"TEAMS!$L$22","v":0}]
[]
[{"$f":"TEAMS!$J$23","v":0},null,null,null,null,null,null,null,null,null,null,"T",null,{"$f":"TEAMS!$L$23","v":0}]
[]
[{"$f":"TEAMS!$J$24","v":0},null,null,null,null,null,null,null,null,null,null,"Sk",null,{"$f":"TEAMS!$L$24","v":0}]
[]
[1,null,"TOTAL SCORE",null,null,null,null,null,null,null,null,null,null,null,null,"TOTAL SCORE"]
[]
["Signature",null,null,null,null,null,null,null,null,null,null,null,null,"Signature"]
[]
[null,null,null,null,null,null,null,null,null,null,null,18]
[]
["Time Match Completed:-"]
[{"$f":"TEAMS!$D$1","v":"CLUB NAME"}]
[]
[{"$f":"TEAMS!$D$3","v":"Tuesday Mens Mufti."}]
[]
[null,null,"RINK",null,null,null,null,null,"DATE"]
[]
[null,null,{"$f":"TEAMS!$K$25","v":0},null,null,null,null,null,{"$f":"TEAMS!$D$2","v":"2011-03-07"}]
[]
[{"$f":"TEAMS!$J$26","v":0},null,null,null,null,null,null,null,null,null,null,"L",null,{"$f":"TEAMS!$L$26","v":0}]
[]
[{"$f":"TEAMS!$J$27","v":0},null,null,null,null,null,null,null,null,null,null,"S",null,{"$f":"TEAMS!$L$27","v":0}]
[]
[{"$f":"TEAMS!$J$28","v":0},null,null,null,null,null,null,null,null,null,null,"T",null,{"$f":"TEAMS!$L$28","v":0}]
[]
[{"$f":"TEAMS!$J$29","v":0},null,null,null,null,null,null,null,null,null,null,"Sk",null,{"$f":"TEAMS!$L$29","v":0}]
[]
[1,null,"TOTAL SCORE",null,null,null,null,null,null,null,null,null,null,null,null,"TOTAL SCORE"]
[]
["Signature",null,null,null,null,null,null,null,null,null,null,null,null,"Signature"]
[]
[null,null,null,null,null,null,null,null,null,null,null,19]
[]
["Time Match Completed:-"]
[{"$f":"TEAMS!$D$1","v":"CLUB NAME"}]
[]
[{"$f":"TEAMS!$D$3","v":"Tuesday Mens Mufti."}]
[]
[null,null,"RINK",null,null,null,null,null,"DATE"]
[]
[null,null,{"$f":"TEAMS!$K$30","v":0},null,null,null,null,null,{"$f":"TEAMS!$D$2","v":"2011-03-07"}]
[]
[{"$f":"TEAMS!$J$31","v":0},null,null,null,null,null,null,null,null,null,null,"L",null,{"$f":"TEAMS!$L$31","v":0}]
[]
[{"$f":"TEAMS!$J$32","v":0},null,null,null,null,null,null,null,null,null,null,"S",null,{"$f":"TEAMS!$L$32","v":0}]
[]
[{"$f":"TEAMS!$J$33","v":0},null,null,null,null,null,null,null,null,null,null,"T",null,{"$f":"TEAMS!$L$33","v":0}]
[]
[{"$f":"TEAMS!$J$34","v":0},null,null,null,null,null,null,null,null,null,null,"Sk",null,{"$f":"TEAMS!$L$34","v":0}]
[]
[1,null,"TOTAL SCORE",null,null,null,null,null,null,null,null,null,null,null,null,"TOTAL SCORE"]
[]
["Signature",null,null,null,null,null,null,null,null,null,null,null,null,"Signature"]
[]
[null,null,null,null,null,null,null,null,null,null,null,20]
[]
["Time Match Completed:-"]
[{"$f":"TEAMS!$D$1","v":"CLUB NAME"}]
[]
[{"$f":"TEAMS!$D$3","v":"Tuesday Mens Mufti."}]
[]
[null,null,"RINK",null,null,null,null,null,"DATE"]
[]
[null,null,{"$f":"TEAMS!$K$35","v":0},null,null,null,null,null,{"$f":"TEAMS!$D$2","v":"2011-03-07"}]
[]
[{"$f":"TEAMS!$J$36","v":0},null,null,null,null,null,null,null,null,null,null,"L",null,{"$f":"TEAMS!$L$36","v":0}]
[]
[{"$f":"TEAMS!$J$37","v":0},null,null,null,null,null,null,null,null,null,null,"S",null,{"$f":"TEAMS!$L$37","v":0}]
[]
[{"$f":"TEAMS!$J$38","v":0},null,null,null,null,null,null,null,null,null,null,"T",null,{"$f":"TEAMS!$L$38","v":0}]
[]
[{"$f":"TEAMS!$J$39","v":0},null,null,null,null,null,null,null,null,null,null,"Sk",null,{"$f":"TEAMS!$L$39","v":0}]
[]
[1,null,"TOTAL SCORE",null,null,null,null,null,null,null,null,null,null,null,null,"TOTAL SCORE"]
[]
["Signature",null,null,null,null,null,null,null,null,null,null,null,null,"Signature"]
[]
[null,null,null,null,null,null,null,null,null,null,null,21]
[]
["Time Match Completed:-"]
[{"$f":"TEAMS!$D$1","v":"CLUB NAME"}]
[]
[{"$f":"TEAMS!$D$3","v":"Tuesday Mens Mufti."}]
[]
[null,null,"RINK",null,null,null,null,null,"DATE"]
[]
[null,null,{"$f":"TEAMS!$O$5","v":0},null,null,null,null,null,{"$f":"TEAMS!$D$2","v":"2011-03-07"}]
[]
[{"$f":"TEAMS!$N$6","v":0},null,null,null,null,null,null,null,null,null,null,"L",null,{"$f":"TEAMS!$P$6","v":0}]
[]
[{"$f":"TEAMS!$N$7","v":0},null,null,null,null,null,null,null,null,null,null,"S",null,{"$f":"TEAMS!$P$7","v":0}]
[]
[{"$f":"TEAMS!$N$8","v":0},null,null,null,null,null,null,null,null,null,null,"T",null,{"$f":"TEAMS!$P$8","v":0}]
[]
[{"$f":"TEAMS!$N$9","v":0},null,null,null,null,null,null,null,null,null,null,"Sk",null,{"$f":"TEAMS!$P$9","v":0}]
[]
[1,null,"TOTAL SCORE",null,null,null,null,null,null,null,null,null,null,null,null,"TOTAL SCORE"]
[]
["Signature",null,null,null,null,null,null,null,null,null,null,null,null,"Signature"]
[]
[null,null,null,null,null,null,null,null,null,null,null,22]
[]
["Time Match Completed:-"]
[{"$f":"TEAMS!$D$1","v":"CLUB NAME"}]
[]
[{"$f":"TEAMS!$D$3","v":"Tuesday Mens Mufti."}]
[]
[null,null,"RINK",null,null,null,null,null,"DATE"]
[]
[null,null,{"$f":"TEAMS!$O$10","v":0},null,null,null,null,null,{"$f":"TEAMS!$D$2","v":"2011-03-07"}]
[]
[{"$f":"TEAMS!$N$11","v":0},null,null,null,null,null,null,null,null,null,null,"L",null,{"$f":"TEAMS!$P$11","v":0}]
[]
[{"$f":"TEAMS!$N$12","v":0},null,null,null,null,null,null,null,null,null,null,"S",null,{"$f":"TEAMS!$P$12","v":0}]
[]
[{"$f":"TEAMS!$N$13","v":0},null,null,null,null,null,null,null,null,null,null,"T",null,{"$f":"TEAMS!$P$13","v":0}]
[]
[{"$f":"TEAMS!$N$14","v":0},null,null,null,null,null,null,null,null,null,null,"Sk",null,{"$f":"TEAMS!$P$14","v":0}]
[]
[1,null,"TOTAL SCORE",null,null,null,null,null,null,null,null,null,null,null,null,"TOTAL SCORE"]
[]
["Signature",null,null,null,null,null,null,null,null,null,null,null,null,"Signature"]
[]
[null,null,null,null,null,null,null,null,null,null,null,23]
[]
["Time Match Completed:-"]
[{"$f":"TEAMS!$D$1","v":"CLUB NAME"}]
[]
[{"$f":"TEAMS!$D$3","v":"Tuesday Mens Mufti."}]
[]
[null,null,"RINK",null,null,null,null,null,"DATE"]
[]
[null,null,{"$f":"TEAMS!$O$15","v":0},null,null,null,null,null,{"$f":"TEAMS!$D$2","v":"2011-03-07"}]
[]
[{"$f":"TEAMS!$N$16","v":0},null,null,null,null,null,null,null,null,null,null,"L",null,{"$f":"TEAMS!$P$16","v":0}]
[]
[{"$f":"TEAMS!$N$17","v":0},null,null,null,null,null,null,null,null,null,null,"S",null,{"$f":"TEAMS!$P$17","v":0}]
[]
[{"$f":"TEAMS!$N$18","v":0},null,null,null,null,null,null,null,null,null,null,"T",null,{"$f":"TEAMS!$P$18","v":0}]
[]
[{"$f":"TEAMS!$N$19","v":0},null,null,null,null,null,null,null,null,null,null,"Sk",null,{"$f":"TEAMS!$P$19","v":0}]
[]
[1,null,"TOTAL SCORE",null,null,null,null,null,null,null,null,null,null,null,null,"TOTAL SCORE"]
[]
["Signature",null,null,null,null,null,null,null,null,null,null,null,null,"Signature"]
[]
[null,null,null,null,null,null,null,null,null,null,null,24]
[]
["Time Match Completed:-"]
[{"$f":"TEAMS!$D$1","v":"CLUB NAME"}]
[]
[{"$f":"TEAMS!$D$3","v":"Tuesday Mens Mufti."}]
[]
[null,null,"RINK",null,null,null,null,null,"DATE"]
[]
[null,null,{"$f":"TEAMS!$O$20","v":0},null,null,null,null,null,{"$f":"TEAMS!$D$2","v":"2011-03-07"}]
[]
[{"$f":"TEAMS!$N$21","v":0},null,null,null,null,null,null,null,null,null,null,"L",null,{"$f":"TEAMS!$P$21","v":0}]
[]
[{"$f":"TEAMS!$N$22","v":0},null,null,null,null,null,null,null,null,null,null,"S",null,{"$f":"TEAMS!$P$22","v":0}]
[]
[{"$f":"TEAMS!$N$23","v":0},null,null,null,null,null,null,null,null,null,null,"T",null,{"$f":"TEAMS!$P$23","v":0}]
[]
[{"$f":"TEAMS!$N$24","v":0},null,null,null,null,null,null,null,null,null,null,"Sk",null,{"$f":"TEAMS!$P$24","v":0}]
[]
[1,null,"TOTAL SCORE",null,null,null,null,null,null,null,null,null,null,null,null,"TOTAL SCORE"]
[]
["Signature",null,null,null,null,null,null,null,null,null,null,null,null,"Signature"]
[]
[null,null,null,null,null,null,null,null,null,null,null,25]
[]
["Time Match Completed:-"]
[{"$f":"TEAMS!$D$1","v":"CLUB NAME"}]
[]
[{"$f":"TEAMS!$D$3","v":"Tuesday Mens Mufti."}]
[]
[null,null,"RINK",null,null,null,null,null,"DATE"]
[]
[null,null,{"$f":"TEAMS!$O$25","v":0},null,null,null,null,null,{"$f":"TEAMS!$D$2","v":"2011-03-07"}]
[]
[{"$f":"TEAMS!$N$26","v":0},null,null,null,null,null,null,null,null,null,null,"L",null,{"$f":"TEAMS!$P$26","v":0}]
[]
[{"$f":"TEAMS!$N$27","v":0},null,null,null,null,null,null,null,null,null,null,"S",null,{"$f":"TEAMS!$P$27","v":0}]
[]
[{"$f":"TEAMS!$N$28","v":0},null,null,null,null,null,null,null,null,null,null,"T",null,{"$f":"TEAMS!$P$28","v":0}]
[]
[{"$f":"TEAMS!$N$29","v":0},null,null,null,null,null,null,null,null,null,null,"Sk",null,{"$f":"TEAMS!$P$29","v":0}]
[]
[1,null,"TOTAL SCORE",null,null,null,null,null,null,null,null,null,null,null,null,"TOTAL SCORE"]
[]
["Signature",null,null,null,null,null,null,null,null,null,null,null,null,"Signature"]
[]
[null,null,null,null,null,null,null,null,null,null,null,26]
[]
["Time Match Completed:-"]
[{"$f":"TEAMS!$D$1","v":"CLUB NAME"}]
[]
[{"$f":"TEAMS!$D$3","v":"Tuesday Mens Mufti."}]
[]
[null,null,"RINK",null,null,null,null,null,"DATE"]
[]
[null,null,{"$f":"TEAMS!$O$30","v":0},null,null,null,null,null,{"$f":"TEAMS!$D$2","v":"2011-03-07"}]
[]
[{"$f":"TEAMS!$N$31","v":0},null,null,null,null,null,null,null,null,null,null,"L",null,{"$f":"TEAMS!$P$31","v":0}]
[]
[{"$f":"TEAMS!$N$32","v":0},null,null,null,null,null,null,null,null,null,null,"S",null,{"$f":"TEAMS!$P$32","v":0}]
[]
[{"$f":"TEAMS!$N$33","v":0},null,null,null,null,null,null,null,null,null,null,"T",null,{"$f":"TEAMS!$P$33","v":0}]
[]
[{"$f":"TEAMS!$N$34","v":0},null,null,null,null,null,null,null,null,null,null,"Sk",null,{"$f":"TEAMS!$P$34","v":0}]
[]
[1,null,"TOTAL SCORE",null,null,null,null,null,null,null,null,null,null,null,null,"TOTAL SCORE"]
[]
["Signature",null,null,null,null,null,null,null,null,null,null,null,null,"Signature"]
[]
[null,null,null,null,null,null,null,null,null,null,null,27]
[]
["Time Match Completed:-"]
[{"$f":"TEAMS!$D$1","v":"CLUB NAME"}]
[]
[{"$f":"TEAMS!$D$3","v":"Tuesday Mens Mufti."}]
[]
[null,null,"RINK",null,null,null,null,null,"DATE"]
[]
[null,null,{"$f":"TEAMS!$O$35","v":0},null,null,null,null,null,{"$f":"TEAMS!$D$2","v":"2011-03-07"}]
[]
[{"$f":"TEAMS!$N$36","v":0},null,null,null,null,null,null,null,null,null,null,"L",null,{"$f":"TEAMS!$P$36","v":0}]
[]
[{"$f":"TEAMS!$N$37","v":0},null,null,null,null,null,null,null,null,null,null,"S",null,{"$f":"TEAMS!$P$37","v":0}]
[]
[{"$f":"TEAMS!$N$38","v":0},null,null,null,null,null,null,null,null,null,null,"T",null,{"$f":"TEAMS!$P$38","v":0}]
[]
[{"$f":"TEAMS!$N$39","v":0},null,null,null,null,null,null,null,null,null,null,"Sk",null,{"$f":"TEAMS!$P$39","v":0}]
[]
[1,null,"TOTAL SCORE",null,null,null,null,null,null,null,null,null,null,null,null,"TOTAL SCORE"]
[]
["Signature",null,null,null,null,null,null,null,null,null,null,null,null,"Signature"]
[]
[null,null,null,null,null,null,null,null,null,null,null,28]
[]
["Time Match Completed:-"]
[{"$f":"TEAMS!$D$1","v":"CLUB NAME"}]
[]
[" "]
[]
[null,null,"RINK",null,null,null,null,null,"DATE"]
[]
[null,null," ",null,null,null,null,null," "]
[]
[" ",null,null,null,null,null,null,null,null,null,null,"L",null," "]
[]
[" ",null,null,null,null,null,null,null,null,null,null,"S",null," "]
[]
[" ",null,null,null,null,null,null,null,null,null,null,"T",null," "]
[]
[" ",null,null,null,null,null,null,null,null,null,null,"Sk",null,{"$f":"TEAMS!$P$39","v":0}]
[]
[1,null,"TOTAL SCORE",null,null,null,null,null,null,null,null,null,null,null,null,"TOTAL SCORE"]
[]
["Signature",null,null,null,null,null,null,null,null,null,null,null,null,"Signature"]
[]
[null,null,null,null,null,null,null,null,null,null,null,29]
[]
["Time Match Completed:-"]

{"sheet":"CARDS 2","index":10,"n_rows":644,"n_cols":16,"rows_kept":644,"cut":false,"hidden":false,"merged":[[0,0,0,23],[2,0,2,23],[4,2,4,6],[4,8,4,23],[12,13,12,23],[6,2,6,6],[6,8,6,23],[8,0,8,10],[8,11,8,12],[8,13,8,23],[14,0,14,10],[14,11,14,12],[14,13,14,23],[16,2,16,8],[16,15,16,21],[10,0,10,10],[10,11,10,12],[10,13,10,23],[12,0,12,10],[12,11,12,12],[20,0,20,10],[20,13,20,23],[22,0,22,11],[22,12,22,23],[20,11,20,12],[17,2,17,8],[17,15,17,21],[18,0,18,10],[18,13,18,23],[29,2,29,6],[29,8,29,23],[31,0,31,10],[31,11,31,12],[31,13,31,23],[23,0,23,23],[25,0,25,23],[27,2,27,6],[27,8,27,23],[37,0,37,10],[37,11,37,12],[37,13,37,23],[39,2,39,8],[39,15,39,21],[33,0,33,10],[33,11,33,12],[33,13,33,23],[35,0,35,10],[35,11,35,12],[35,13,35,23],[43,0,43,10],[43,13,43,23],[45,0,45,11],[45,12,45,23],[43,11,43,12],[40,2,40,8],[40,15,40,21],[41,0,41,10],[41,13,41,23],[52,2,52,6],[52,8,52,23],[54,0,54,10],[54,11,54,12],[54,13,54,23],[46,0,46,23],[48,0,48,23],[50,2,50,6],[50,8,50,23],[60,0,60,10],[60,11,60,12],[60,13,60,23],[62,2,62,8],[62,15,62,21],[56,0,56,10],[56,11,56,12],[56,13,56,23],[58,0,58,10],[58,11,58,12],[58,13,58,23],[66,0,66,10],[66,13,66,23],[68,0,68,11],[68,12,68,23],[66,11,66,12],[63,2,63,8],[63,15,63,21],[64,0,64,10],[64,13,64,23],[75,2,75,6],[75,8,75,23],[77,0,77,10],[77,11,77,12],[77,13,77,23],[69,0,69,23],[71,0,71,23],[73,2,73,6],[73,8,73,23],[83,0,83,10],[83,11,83,12],[83,13,83,23],[85,2,85,8],[85,15,85,21],[79,0,79,10],[79,11,79,12],[79,13,79,23],[81,0,81,10],[81,11,81,12],[81,13,81,23],[89,0,89,10],[89,13,89,23],[91,0,91,11],[91,12,91,23],[89,11,89,12],[86,2,86,8],[86,15,86,21],[87,0,87,10],[87,13,87,23],[98,2,98,6],[98,8,98,23],[100,0,100,10],[100,11,100,12],[100,13,100,23],[92,0,92,23],[94,0,94,23],[96,2,96,6],[96,8,96,23],[106,0,106,10],[106,11,106,12],[106,13,106,23],[108,2,108,8],[108,15,108,21],[102,0,102,10],[102,11,102,12],[102,13,102,23],[104,0,104,10],[104,11,104,12],[104,13,104,23],[112,0,112,10],[112,13,112,23],[114,0,114,11],[114,12,114,23],[112,11,112,12],[109,2,109,8],[109,15,109,21],[110,0,110,10],[110,13,110,23],[121,2,121,6],[121,8,121,23],[123,0,123,10],[123,11,123,12],[123,13,123,23],[115,0,115,23],[117,0,117,23],[119,2,119,6],[119,8,119,23],[129,0,129,10],[129,11,129,12],[129,13,129,23],[131,2,131,8],[131,15,131,21],[125,0,125,10],[125,11,125,12],[125,13,125,23],[127,0,127,10],[127,11,127,12],[127,13,127,23],[135,0,135,10],[135,13,135,23],[137,0,137,11],[137,12,137,23],[135,11,135,12],[132,2,132,8],[132,15,132,21],[133,0,133,10],[133,13,133,23],[144,2,144,6],[144,8,144,23],[146,0,146,10],[146,11,146,12],[146,13,146,23],[138,0,138,23],[140,0,140,23],[142,2,142,6],[142,8,142,23],[152,0,152,10],[152,11,152,12],[152,13,152,23],[154,2,154,8],[154,15,154,21],[148,0,148,10],[148,11,148,12],[148,13,148,23],[150,0,150,10],[150,11,150,12],[150,13,150,23],[158,0,158,10],[158,13,158,23],[160,0,160,11],[160,12,160,23],[158,11,158,12],[155,2,155,8],[155,15,155,21],[156,0,156,10],[156,13,156,23],[167,2,167,6],[167,8,167,23],[169,0,169,10],[169,11,169,12],[169,13,169,23],[161,0,161,23],[163,0,163,23],[165,2,165,6],[165,8,165,23],[175,0,175,10],[175,11,175,12],[175,13,175,23],[177,2,177,8],[177,15,177,21],[171,0,171,10],[171,11,171,12],[171,13,171,23],[173,0,173,10],[173,11,173,12],[173,13,173,23],[181,0,181,10],[181,13,181,23],[183,0,183,11],[183,12,183,23],[181,11,181,12],[178,2,178,8],[178,15,178,21],[179,0,179,10],[179,13,179,23],[190,2,190,6],[190,8,190,23],[192,0,192,10],[192,11,192,12],[192,13,192,23],[184,0,184,23],[186,0,186,23],[188,2,188,6],[188,8,188,23],[198,0,198,10],[198,11,198,12],[198,13,198,23],[200,2,200,8],[200,15,200,21],[194,0,194,10],[194,11,194,12],[194,13,194,23],[196,0,196,10],[196,11,196,12],[196,13,196,23],[204,0,204,10],[204,13,204,23],[206,0,206,11],[206,12,206,23],[204,11,204,12],[201,2,201,8],[201,15,201,21],[202,0,202,10],[202,13,202,23],[213,2,213,6],[213,8,213,23],[215,0,215,10],[215,11,215,12],[215,13,215,23],[207,0,207,23],[209,0,209,23],[211,2,211,6],[211,8,211,23],[221,0,221,10],[221,11,221,12],[221,13,221,23],[223,2,223,8],[223,15,223,21],[217,0,217,10],[217,11,217,12],[217,13,217,23],[219,0,219,10],[219,11,219,12],[219,13,219,23],[227,0,227,10],[227,13,227,23],[229,0,229,11],[229,12,229,23],[227,11,227,12],[224,2,224,8],[224,15,224,21],[225,0,225,10],[225,13,225,23],[236,2,236,6],[236,8,236,23],[238,0,238,10],[238,11,238,12],[238,13,238,23],[230,0,230,23],[232,0,232,23],[234,2,234,6],[234,8,234,23],[244,0,244,10],[244,11,244,12],[244,13,244,23],[246,2,246,8],[246,15,246,21],[240,0,240,10],[240,11,240,12],[240,13,240,23],[242,0,242,10],[242,11,242,12],[242,13,242,23],[250,0,250,10],[250,13,250,23],[252,0,252,11],[252,12,252,23],[250,11,250,12],[247,2,247,8],[247,15,247,21],[248,0,248,10],[248,13,248,23],[259,2,259,6],[259,8,259,23],[261,0,261,10],[261,11,261,12],[261,13,261,23],[253,0,253,23],[255,0,255,23],[257,2,257,6],[257,8,257,23],[267,0,267,10],[267,11,267,12],[267,13,267,23],[269,2,269,8],[269,15,269,21],[263,0,263,10],[263,11,263,12],[263,13,263,23],[265,0,265,10],[265,11,265,12],[265,13,265,23],[273,0,273,10],[273,13,273,23],[275,0,275,11],[275,12,275,23],[273,11,273,12],[270,2,270,8],[270,15,270,21],[271,0,271,10],[271,13,271,23],[282,2,282,6],[282,8,282,23],[284,0,284,10],[284,11,284,12],[284,13,284,23],[276,0,276,23],[278,0,278,23],[280,2,280,6],[280,8,280,23],[290,0,290,10],[290,11,290,12],[290,13,290,23],[292,2,292,8],[292,15,292,21],[286,0,286,10],[286,11,286,12],[286,13,286,23],[288,0,288,10],[288,11,288,12],[288,13,288,23],[296,0,296,10],[296,13,296,23],[298,0,298,11],[298,12,298,23],[296,11,296,12],[293,2,293,8],[293,15,293,21],[294,0,294,10],[294,13,294,23],[305,2,305,6],[305,8,305,23],[307,0,307,10],[307,11,307,12],[307,13,307,23],[299,0,299,23],[301,0,301,23],[303,2,303,6],[303,8,303,23],[313,0,313,10],[313,11,313,12],[313,13,313,23],[315,2,315,8],[315,15,315,21],[309,0,309,10],[309,11,309,12],[309,13,309,23],[311,0,311,10],[311,11,311,12],[311,13,311,23],[319,0,319,10],[319,13,319,23],[321,0,321,11],[321,12,321,23],[319,11,319,12],[316,2,316,8],[316,15,316,21],[317,0,317,10],[317,13,317,23],[328,2,328,6],[328,8,328,23],[330,0,330,10],[330,11,330,12],[330,13,330,23],[322,0,322,23],[324,0,324,23],[326,2,326,6],[326,8,326,23],[336,0,336,10],[336,11,336,12],[336,13,336,23],[338,2,338,8],[338,15,338,21],[332,0,332,10],[332,11,332,12],[332,13,332,23],[334,0,334,10],[334,11,334,12],[334,13,334,23],[342,0,342,10],[342,13,342,23],[344,0,344,11],[344,12,344,23],[342,11,342,12],[339,2,339,8],[339,15,339,21],[340,0,340,10],[340,13,340,23],[351,2,351,6],[351,8,351,23],[353,0,353,10],[353,11,353,12],[353,13,353,23],[345,0,345,23],[347,0,347,23],[349,2,349,6],[349,8,349,23],[359,0,359,10],[359,11,359,12],[359,13,359,23],[361,2,361,8],[361,15,361,21],[355,0,355,10],[355,11,355,12],[355,13,355,23],[357,0,357,10],[357,11,357,12],[357,13,357,23],[365,0,365,10],[365,13,365,23],[367,0,367,11],[367,12,367,23],[365,11,365,12],[362,2,362,8],[362,15,362,21],[363,0,363,10],[363,13,363,23],[374,2,374,6],[374,8,374,23],[376,0,376,10],[376,11,376,12],[376,13,376,23],[368,0,368,23],[370,0,370,23],[372,2,372,6],[372,8,372,23],[382,0,382,10],[382,11,382,12],[382,13,382,23],[384,2,384,8],[384,15,384,21],[378,0,378,10],[378,11,378,12],[378,13,378,23],[380,0,380,10],[380,11,380,12],[380,13,380,23],[388,0,388,10],[388,13,388,23],[390,0,390,11],[390,12,390,23],[388,11,388,12],[385,2,385,8],[385,15,385,21],[386,0,386,10],[386,13,386,23],[397,2,397,6],[397,8,397,23],[399,0,399,10],[399,11,399,12],[399,13,399,23],[391,0,391,23],[393,0,393,23],[395,2,395,6],[395,8,395,23],[405,0,405,10],[405,11,405,12],[405,13,405,23],[407,2,407,8],[407,15,407,21],[401,0,401,10],[401,11,401,12],[401,13,401,23],[403,0,403,10],[403,11,403,12],[403,13,403,23],[411,0,411,10],[411,13,411,23],[413,0,413,11],[413,12,413,23],[411,11,411,12],[408,2,408,8],[408,15,408,21],[409,0,409,10],[409,13,409,23],[420,2,420,6],[420,8,420,23],[422,0,422,10],[422,11,422,12],[422,13,422,23],[414,0,414,23],[416,0,416,23],[418,2,418,6],[418,8,418,23],[428,0,428,10],[428,11,428,12],[428,13,428,23],[430,2,430,8],[430,15,430,21],[424,0,424,10],[424,11,424,12],[424,13,424,23],[426,0,426,10],[426,11,426,12],[426,13,426,23],[434,0,434,10],[434,13,434,23],[436,0,436,11],[436,12,436,23],[434,11,434,12],[431,2,431,8],[431,15,431,21],[432,0,432,10],[432,13,432,23],[443,2,443,6],[443,8,443,23],[445,0,445,10],[445,11,445,12],[445,13,445,23],[437,0,437,23],[439,0,439,23],[441,2,441,6],[441,8,441,23],[451,0,451,10],[451,11,451,12],[451,13,451,23],[453,2,453,8],[453,15,453,21],[447,0,447,10],[447,11,447,12],[447,13,447,23],[449,0,449,10],[449,11,449,12],[449,13,449,23],[457,0,457,10],[457,13,457,23],[459,0,459,11],[459,12,459,23],[457,11,457,12],[454,2,454,8],[454,15,454,21],[455,0,455,10],[455,13,455,23],[466,2,466,6],[466,8,466,23],[468,0,468,10],[468,11,468,12],[468,13,468,23],[460,0,460,23],[462,0,462,23],[464,2,464,6],[464,8,464,23],[474,0,474,10],[474,11,474,12],[474,13,474,23],[476,2,476,8],[476,15,476,21],[470,0,470,10],[470,11,470,12],[470,13,470,23],[472,0,472,10],[472,11,472,12],[472,13,472,23],[480,0,480,10],[480,13,480,23],[482,0,482,11],[482,12,482,23],[480,11,480,12],[477,2,477,8],[477,15,477,21],[478,0,478,10],[478,13,478,23],[489,2,489,6],[489,8,489,23],[491,0,491,10],[491,11,491,12],[491,13,491,23],[483,0,483,23],[485,0,485,23],[487,2,487,6],[487,8,487,23],[497,0,497,10],[497,11,497,12],[497,13,497,23],[499,2,499,8],[499,15,499,21],[493,0,493,10],[493,11,493,12],[493,13,493,23],[495,0,495,10],[495,11,495,12],[495,13,495,23],[503,0,503,10],[503,13,503,23],[505,0,505,11],[505,12,505,23],[503,11,503,12],[500,2,500,8],[500,15,500,21],[501,0,501,10],[501,13,501,23],[512,2,512,6],[512,8,512,23],[514,0,514,10],[514,11,514,12],[514,13,514,23],[506,0,506,23],[508,0,508,23],[510,2,510,6],[510,8,510,23],[520,0,520,10],[520,11,520,12],[520,13,520,23],[522,2,522,8],[522,15,522,21],[516,0,516,10],[516,11,516,12],[516,13,516,23],[518,0,518,10],[518,11,518,12],[518,13,518,23],[526,0,526,10],[526,13,526,23],[528,0,528,11],[528,12,528,23],[526,11,526,12],[523,2,523,8],[523,15,523,21],[524,0,524,10],[524,13,524,23],[535,2,535,6],[535,8,535,23],[537,0,537,10],[537,11,537,12],[537,13,537,23],[529,0,529,23],[531,0,531,23],[533,2,533,6],[533,8,533,23],[543,0,543,10],[543,11,543,12],[543,13,543,23],[545,2,545,8],[545,15,545,21],[539,0,539,10],[539,11,539,12],[539,13,539,23],[541,0,541,10],[541,11,541,12],[541,13,541,23],[549,0,549,10],[549,13,549,23],[551,0,551,11],[551,12,551,23],[549,11,549,12],[546,2,546,8],[546,15,546,21],[547,0,547,10],[547,13,547,23],[558,2,558,6],[558,8,558,23],[560,0,560,10],[560,11,560,12],[560,13,560,23],[552,0,552,23],[554,0,554,23],[556,2,556,6],[556,8,556,23],[566,0,566,10],[566,11,566,12],[566,13,566,23],[568,2,568,8],[568,15,568,21],[562,0,562,10],[562,11,562,12],[562,13,562,23],[564,0,564,10],[564,11,564,12],[564,13,564,23],[572,0,572,10],[572,13,572,23],[574,0,574,11],[574,12,574,23],[572,11,572,12],[569,2,569,8],[569,15,569,21],[570,0,570,10],[570,13,570,23],[581,2,581,6],[581,8,581,23],[583,0,583,10],[583,11,583,12],[583,13,583,23],[575,0,575,23],[577,0,577,23],[579,2,579,6],[579,8,579,23],[589,0,589,10],[589,11,589,12],[589,13,589,23],[591,2,591,8],[591,15,591,21],[585,0,585,10],[585,11,585,12],[585,13,585,23],[587,0,587,10],[587,11,587,12],[587,13,587,23],[595,0,595,10],[595,13,595,23],[597,0,597,11],[597,12,597,23],[595,11,595,12],[592,2,592,8],[592,15,592,21],[593,0,593,10],[593,13,593,23],[604,2,604,6],[604,8,604,23],[606,0,606,10],[606,11,606,12],[606,13,606,23],[598,0,598,23],[600,0,600,23],[602,2,602,6],[602,8,602,23],[612,0,612,10],[612,11,612,12],[612,13,612,23],[614,2,614,8],[614,15,614,21],[608,0,608,10],[608,11,608,12],[608,13,608,23],[610,0,610,10],[610,11,610,12],[610,13,610,23],[618,0,618,10],[618,13,618,23],[620,0,620,11],[620,12,620,23],[618,11,618,12],[615,2,615,8],[615,15,615,21],[616,0,616,10],[616,13,616,23],[631,13,631,23],[633,0,633,10],[633,11,633,12],[633,13,633,23],[631,0,631,10],[631,11,631,12],[629,11,629,12],[629,13,629,23],[621,0,621,23],[623,0,623,23],[625,2,625,6],[625,8,625,23],[627,2,627,6],[627,8,627,23],[629,0,629,10],[641,13,641,23],[643,0,643,11],[643,12,643,23],[641,11,641,12],[641,0,641,10],[638,15,638,21],[639,0,639,10],[639,13,639,23],[635,0,635,10],[635,11,635,12],[635,13,635,23],[637,2,637,8],[637,15,637,21],[638,2,638,8]]}
[{"$f":"TEAMS!$D$1","v":"CLUB NAME"}]
[]
[{"$f":"TEAMS!$D$3","v":"Tuesday Mens Mufti."}]
[]
[null,null,"RINK",null,null,null,null,null,"DATE"]
[]
[null,null,{"$f":"TEAMS!$C$5","v":0},null,null,null,null,null,{"$f":"TEAMS!$D$2","v":"2011-03-07"}]
[]
[{"$f":"TEAMS!$D$6","v":0},null,null,null,null,null,null,null,null,null,null,"L",null,{"$f":"TEAMS!$B$6","v":0}]
[]
[{"$f":"TEAMS!$D$7","v":0},null,null,null,null,null,null,null,null,null,null,"S",null,{"$f":"TEAMS!$B$7","v":0}]
[]
[{"$f":"TEAMS!$D$8","v":0},null,null,null,null,null,null,null,null,null,null,"T",null,{"$f":"TEAMS!$B$8","v":0}]
[]
[{"$f":"TEAMS!$D$9","v":0},null,null,null,null,null,null,null,null,null,null,"Sk",null,{"$f":"TEAMS!$B$9","v":0}]
[]
[2,null,"TOTAL SCORE",null,null,null,null,null,null,null,null,null,null,null,null,"TOTAL SCORE"]
[]
["Signature",null,null,null,null,null,null,null,null,null,null,null,null,"Signature"]
[]
[null,null,null,null,null,null,null,null,null,null,null,1]
[]
["Time Match Completed:-"]
[{"$f":"TEAMS!$D$1","v":"CLUB NAME"}]
[]
[{"$f":"TEAMS!$D$3","v":"Tuesday Mens Mufti."}]
[]
[null,null,"RINK",null,null,null,null,null,"DATE"]
[]
[null,null,{"$f":"TEAMS!$C$10","v":0},null,null,null,null,null,{"$f":"TEAMS!$D$2","v":"2011-03-07"}]
[]
[{"$f":"TEAMS!$D$11","v":0},null,null,null,null,null,null,null,null,null,null,"L",null,{"$f":"TEAMS!$B$11","v":0}]
[]
[{"$f":"TEAMS!$D$12","v":0},null,null,null,null,null,null,null,null,null,null,"S",null,{"$f":"TEAMS!$B$12","v":0}]
[]
[{"$f":"TEAMS!$D$13","v":0},null,null,null,null,null,null,null,null,null,null,"T",null,{"$f":"TEAMS!$B$13","v":0}]
[]
[{"$f":"TEAMS!$D$14","v":0},null,null,null,null,null,null,null,null,null,null,"Sk",null,{"$f":"TEAMS!$B$14","v":0}]
[]
[2,null,"TOTAL SCORE",null,null,null,null,null,null,null,null,null,null,null,null,"TOTAL SCORE"]
[]
["Signature",null,null,null,null,null,null,null,null,null,null,null,null,"Signature"]
[]
[null,null,null,null,null,null,null,null,null,null,null,2]
[]
["Time Match Completed:-"]
[{"$f":"TEAMS!$D$1","v":"CLUB NAME"}]
[]
[{"$f":"TEAMS!$D$3","v":"Tuesday Mens Mufti."}]
[]
[null,null,"RINK",null,null,null,null,null,"DATE"]
[]
[null,null,{"$f":"TEAMS!$C$15","v":0},null,null,null,null,null,{"$f":"TEAMS!$D$2","v":"2011-03-07"}]
[]
[{"$f":"TEAMS!$D$16","v":0},null,null,null,null,null,null,null,null,null,null,"L",null,{"$f":"TEAMS!$B$16","v":0}]
[]
[{"$f":"TEAMS!$D$17","v":0},null,null,null,null,null,null,null,null,null,null,"S",null,{"$f":"TEAMS!$B$17","v":0}]
[]
[{"$f":"TEAMS!$D$18","v":0},null,null,null,null,null,null,null,null,null,null,"T",null,{"$f":"TEAMS!$B$18","v":0}]
[]
[{"$f":"TEAMS!$D$19","v":0},null,null,null,null,null,null,null,null,null,null,"Sk",null,{"$f":"TEAMS!$B$19","v":0}]
[]
[2,null,"TOTAL SCORE",null,null,null,null,null,null,null,null,null,null,null,null,"TOTAL SCORE"]
[]
["Signature",null,null,null,null,null,null,null,null,null,null,null,null,"Signature"]
[]
[null,null,null,null,null,null,null,null,null,null,null,3]
[]
["Time Match Completed:-"]
[{"$f":"TEAMS!$D$1","v":"CLUB NAME"}]
[]
[{"$f":"TEAMS!$D$3","v":"Tuesday Mens Mufti."}]
[]
[null,null,"RINK",null,null,null,null,null,"DATE"]
[]
[null,null,{"$f":"TEAMS!$C$20","v":0},null,null,null,null,null,{"$f":"TEAMS!$D$2","v":"2011-03-07"}]
[]
[{"$f":"TEAMS!$D$21","v":0},null,null,null,null,null,null,null,null,null,null,"L",null,{"$f":"TEAMS!$B$21","v":0}]
[]
[{"$f":"TEAMS!$D$22","v":0},null,null,null,null,null,null,null,null,null,null,"S",null,{"$f":"TEAMS!$B$22","v":0}]
[]
[{"$f":"TEAMS!$D$23","v":0},null,null,null,null,null,null,null,null,null,null,"T",null,{"$f":"TEAMS!$B$23","v":0}]
[]
[{"$f":"TEAMS!$D$24","v":0},null,null,null,null,null,null,null,null,null,null,"Sk",null,{"$f":"TEAMS!$B$24","v":0}]
[]
[2,null,"TOTAL SCORE",null,null,null,null,null,null,null,null,null,null,null,null,"TOTAL SCORE"]
[]
["Signature",null,null,null,null,null,null,null,null,null,null,null,null,"Signature"]
[]
[null,null,null,null,null,null,null,null,null,null,null,4]
[]
["Time Match Completed:-"]
[{"$f":"TEAMS!$D$1","v":"CLUB NAME"}]
[]
[{"$f":"TEAMS!$D$3","v":"Tuesday Mens Mufti."}]
[]
[null,null,"RINK",null,null,null,null,null,"DATE"]
[]
[null,null,{"$f":"TEAMS!$C$25","v":0},null,null,null,null,null,{"$f":"TEAMS!$D$2","v":"2011-03-07"}]
[]
[{"$f":"TEAMS!$D$26","v":0},null,null,null,null,null,null,null,null,null,null,"L",null,{"$f":"TEAMS!$B$26","v":0}]
[]
[{"$f":"TEAMS!$D$27","v":0},null,null,null,null,null,null,null,null,null,null,"S",null,{"$f":"TEAMS!$B$27","v":0}]
[]
[{"$f":"TEAMS!$D$28","v":0},null,null,null,null,null,null,null,null,null,null,"T",null,{"$f":"TEAMS!$B$28","v":0}]
[]
[{"$f":"TEAMS!$D$29","v":0},null,null,null,null,null,null,null,null,null,null,"Sk",null,{"$f":"TEAMS!$B$29","v":0}]
[]
[2,null,"TOTAL SCORE",null,null,null,null,null,null,null,null,null,null,null,null,"TOTAL SCORE"]
[]
["Signature",null,null,null,null,null,null,null,null,null,null,null,null,"Signature"]
[]
[null,null,null,null,null,null,null,null,null,null,null,5]
[]
["Time Match Completed:-"]
[{"$f":"TEAMS!$D$1","v":"CLUB NAME"}]
[]
[{"$f":"TEAMS!$D$3","v":"Tuesday Mens Mufti."}]
[]
[null,null,"RINK",null,null,null,null,null,"DATE"]
[]
[null,null,{"$f":"TEAMS!$C$30","v":0},null,null,null,null,null,{"$f":"TEAMS!$D$2","v":"2011-03-07"}]
[]
[{"$f":"TEAMS!$D$31","v":0},null,null,null,null,null,null,null,null,null,null,"L",null,{"$f":"TEAMS!$B$31","v":0}]
[]
[{"$f":"TEAMS!$D$32","v":0},null,null,null,null,null,null,null,null,null,null,"S",null,{"$f":"TEAMS!$B$32","v":0}]
[]
[{"$f":"TEAMS!$D$33","v":0},null,null,null,null,null,null,null,null,null,null,"T",null,{"$f":"TEAMS!$B$33","v":0}]
[]
[{"$f":"TEAMS!$D$34","v":0},null,null,null,null,null,null,null,null,null,null,"Sk",null,{"$f":"TEAMS!$B$34","v":0}]
[]
[2,null,"TOTAL SCORE",null,null,null,null,null,null,null,null,null,null,null,null,"TOTAL SCORE"]
[]
["Signature",null,null,null,null,null,null,null,null,null,null,null,null,"Signature"]
[]
[null,null,null,null,null,null,null,null,null,null,null,6]
[]
["Time Match Completed:-"]
[{"$f":"TEAMS!$D$1","v":"CLUB NAME"}]
[]
[{"$f":"TEAMS!$D$3","v":"Tuesday Mens Mufti."}]
[]
[null,null,"RINK",null,null,null,null,null,"DATE"]
[]
[null,null,{"$f":"TEAMS!$C$35","v":0},null,null,null,null,null,{"$f":"TEAMS!$D$2","v":"2011-03-07"}]
[]
[{"$f":"TEAMS!$D$36","v":0},null,null,null,null,null,null,null,null,null,null,"L",null,{"$f":"TEAMS!$B$36","v":0}]
[]
[{"$f":"TEAMS!$D$37","v":0},null,null,null,null,null,null,null,null,null,null,"S",null,{"$f":"TEAMS!$B$37","v":0}]
[]
[{"$f":"TEAMS!$D$38","v":0},null,null,null,null,null,null,null,null,null,null,"T",null,{"$f":"TEAMS!$B$38","v":0}]
[]
[{"$f":"TEAMS!$D$39","v":0},null,null,null,null,null,null,null,null,null,null,"Sk",null,{"$f":"TEAMS!$B$39","v":0}]
[]
[2,null,"TOTAL SCORE",null,null,null,null,null,null,null,null,null,null,null,null,"TOTAL SCORE"]
[]
["Signature",null,null,null,null,null,null,null,null,null,null,null,null,"Signature"]
[]
[null,null,null,null,null,null,null,null,null,null,null,7]
[]
["Time Match Completed:-"]
[{"$f":"TEAMS!$D$1","v":"CLUB NAME"}]
[]
[{"$f":"TEAMS!$D$3","v":"Tuesday Mens Mufti."}]
[]
[null,null,"RINK",null,null,null,null,null,"DATE"]
[]
[null,null,{"$f":"TEAMS!$G$5","v":0},null,null,null,null,null,{"$f":"TEAMS!$D$2","v":"2011-03-07"}]
[]
[{"$f":"TEAMS!$H$6","v":0},null,null,null,null,null,null,null,null,null,null,"L",null,{"$f":"TEAMS!$F$6","v":0}]
[]
[{"$f":"TEAMS!$H$7","v":0},null,null,null,null,null,null,null,null,null,null,"S",null,{"$f":"TEAMS!$F$7","v":0}]
[]
[{"$f":"TEAMS!$H$8","v":0},null,null,null,null,null,null,null,null,null,null,"T",null,{"$f":"TEAMS!$F$8","v":0}]
[]
[{"$f":"TEAMS!$H$9","v":0},null,null,null,null,null,null,null,null,null,null,"Sk",null,{"$f":"TEAMS!$F$9","v":0}]
[]
[2,null,"TOTAL SCORE",null,null,null,null,null,null,null,null,null,null,null,null,"TOTAL SCORE"]
[]
["Signature",null,null,null,null,null,null,null,null,null,null,null,null,"Signature"]
[]
[null,null,null,null,null,null,null,null,null,null,null,8]
[]
["Time Match Completed:-"]
[{"$f":"TEAMS!$D$1","v":"CLUB NAME"}]
[]
[{"$f":"TEAMS!$D$3","v":"Tuesday Mens Mufti."}]
[]
[null,null,"RINK",null,null,null,null,null,"DATE"]
[]
[null,null,{"$f":"TEAMS!$G$10","v":0},null,null,null,null,null,{"$f":"TEAMS!$D$2","v":"2011-03-07"}]
[]
[{"$f":"TEAMS!$H$11","v":0},null,null,null,null,null,null,null,null,null,null,"L",null,{"$f":"TEAMS!$F$11","v":0}]
[]
[{"$f":"TEAMS!$H$12","v":0},null,null,null,null,null,null,null,null,null,null,"S",null,{"$f":"TEAMS!$F$12","v":0}]
[]
[{"$f":"TEAMS!$H$13","v":0},null,null,null,null,null,null,null,null,null,null,"T",null,{"$f":"TEAMS!$F$13","v":0}]
[]
[{"$f":"TEAMS!$H$14","v":0},null,null,null,null,null,null,null,null,null,null,"Sk",null,{"$f":"TEAMS!$F$14","v":0}]
[]
[2,null,"TOTAL SCORE",null,null,null,null,null,null,null,null,null,null,null,null,"TOTAL SCORE"]
[]
["Signature",null,null,null,null,null,null,null,null,null,null,null,null,"Signature"]
[]
[null,null,null,null,null,null,null,null,null,null,null,9]
[]
["Time Match Completed:-"]
[{"$f":"TEAMS!$D$1","v":"CLUB NAME"}]
[]
[{"$f":"TEAMS!$D$3","v":"Tuesday Mens Mufti."}]
[]
[null,null,"RINK",null,null,null,null,null,"DATE"]
[]
[null,null,{"$f":"TEAMS!$G$15","v":0},null,null,null,null,null,{"$f":"TEAMS!$D$2","v":"2011-03-07"}]
[]
[{"$f":"TEAMS!$H$16","v":0},null,null,null,null,null,null,null,null,null,null,"L",null,{"$f":"TEAMS!$F$16","v":0}]
[]
[{"$f":"TEAMS!$H$17","v":0},null,null,null,null,null,null,null,null,null,null,"S",null,{"$f":"TEAMS!$F$17","v":0}]
[]
[{"$f":"TEAMS!$H$18","v":0},null,null,null,null,null,null,null,null,null,null,"T",null,{"$f":"TEAMS!$F$18","v":0}]
[]
[{"$f":"TEAMS!$H$19","v":0},null,null,null,null,null,null,null,null,null,null,"Sk",null,{"$f":"TEAMS!$F$19","v":0}]
[]
[2,null,"TOTAL SCORE",null,null,null,null,null,null,null,null,null,null,null,null,"TOTAL SCORE"]
[]
["Signature",null,null,null,null,null,null,null,null,null,null,null,null,"Signature"]
[]
[null,null,null,null,null,null,null,null,null,null,null,10]
[]
["Time Match Completed:-"]
[{"$f":"TEAMS!$D$1","v":"CLUB NAME"}]
[]
[{"$f":"TEAMS!$D$3","v":"Tuesday Mens Mufti."}]
[]
[null,null,"RINK",null,null,null,null,null,"DATE"]
[]
[null,null,{"$f":"TEAMS!$G$20","v":0},null,null,null,null,null,{"$f":"TEAMS!$D$2","v":"2011-03-07"}]
[]
[{"$f":"TEAMS!$H$21","v":0},null,null,null,null,null,null,null,null,null,null,"L",null,{"$f":"TEAMS!$F$21","v":0}]
[]
[{"$f":"TEAMS!$H$22","v":0},null,null,null,null,null,null,null,null,null,null,"S",null,{"$f":"TEAMS!$F$22","v":0}]
[]
[{"$f":"TEAMS!$H$23","v":0},null,null,null,null,null,null,null,null,null,null,"T",null,{"$f":"TEAMS!$F$23","v":0}]
[]
[{"$f":"TEAMS!$H$24","v":0},null,null,null,null,null,null,null,null,null,null,"Sk",null,{"$f":"TEAMS!$F$24","v":0}]
[]
[2,null,"TOTAL SCORE",null,null,null,null,null,null,null,null,null,null,null,null,"TOTAL SCORE"]
[]
["Signature",null,null,null,null,null,null,null,null,null,null,null,null,"Signature"]
[]
[null,null,null,null,null,null,null,null,null,null,null,11]
[]
["Time Match Completed:-"]
[{"$f":"TEAMS!$D$1","v":"CLUB NAME"}]
[]
[{"$f":"TEAMS!$D$3","v":"Tuesday Mens Mufti."}]
[]
[null,null,"RINK",null,null,null,null,null,"DATE"]
[]
[null,null,{"$f":"TEAMS!$G$25","v":0},null,null,null,null,null,{"$f":"TEAMS!$D$2","v":"2011-03-07"}]
[]
[{"$f":"TEAMS!$H$26","v":0},null,null,null,null,null,null,null,null,null,null,"L",null,{"$f":"TEAMS!$F$26","v":0}]
[]
[{"$f":"TEAMS!$H$27","v":0},null,null,null,null,null,null,null,null,null,null,"S",null,{"$f":"TEAMS!$F$27","v":0}]
[]
[{"$f":"TEAMS!$H$28","v":0},null,null,null,null,null,null,null,null,null,null,"T",null,{"$f":"TEAMS!$F$28","v":0}]
[]
[{"$f":"TEAMS!$H$29","v":0},null,null,null,null,null,null,null,null,null,null,"Sk",null,{"$f":"TEAMS!$F$29","v":0}]
[]
[2,null,"TOTAL SCORE",null,null,null,null,null,null,null,null,null,null,null,null,"TOTAL SCORE"]
[]
["Signature",null,null,null,null,null,null,null,null,null,null,null,null,"Signature"]
[]
[null,null,null,null,null,null,null,null,null,null,null,12]
[]
["Time Match Completed:-"]
[{"$f":"TEAMS!$D$1","v":"CLUB NAME"}]
[]
[{"$f":"TEAMS!$D$3","v":"Tuesday Mens Mufti."}]
[]
[null,null,"RINK",null,null,null,null,null,"DATE"]
[]
[null,null,{"$f":"TEAMS!$G$30","v":0},null,null,null,null,null,{"$f":"TEAMS!$D$2","v":"2011-03-07"}]
[]
[{"$f":"TEAMS!$H$31","v":0},null,null,null,null,null,null,null,null,null,null,"L",null,{"$f":"TEAMS!$F$31","v":0}]
[]
[{"$f":"TEAMS!$H$32","v":0},null,null,null,null,null,null,null,null,null,null,"S",null,{"$f":"TEAMS!$F$32","v":0}]
[]
[{"$f":"TEAMS!$H$33","v":0},null,null,null,null,null,null,null,null,null,null,"T",null,{"$f":"TEAMS!$F$33","v":0}]
[]
[{"$f":"TEAMS!$H$34","v":0},null,null,null,null,null,null,null,null,null,null,"Sk",null,{"$f":"TEAMS!$F$34","v":0}]
[]
[2,null,"TOTAL SCORE",null,null,null,null,null,null,null,null,null,null,null,null,"TOTAL SCORE"]
[]
["Signature",null,null,null,null,null,null,null,null,null,null,null,null,"Signature"]
[]
[null,null,null,null,null,null,null,null,null,null,null,13]
[]
["Time Match Completed:-"]
[{"$f":"TEAMS!$D$1","v":"CLUB NAME"}]
[]
[{"$f":"TEAMS!$D$3","v":"Tuesday Mens Mufti."}]
[]
[null,null,"RINK",null,null,null,null,null,"DATE"]
[]
[null,null,{"$f":"TEAMS!$G$35","v":0},null,null,null,null,null,{"$f":"TEAMS!$D$2","v":"2011-03-07"}]
[]
[{"$f":"TEAMS!$H$36","v":0},null,null,null,null,null,null,null,null,null,null,"L",null,{"$f":"TEAMS!$F$36","v":0}]
[]
[{"$f":"TEAMS!$H$37","v":0},null,null,null,null,null,null,null,null,null,null,"S",null,{"$f":"TEAMS!$F$37","v":0}]
[]
[{"$f":"TEAMS!$H$38","v":0},null,null,null,null,null,null,null,null,null,null,"T",null,{"$f":"TEAMS!$F$38","v":0}]
[]
[{"$f":"TEAMS!$H$39","v":0},null,null,null,null,null,null,null,null,null,null,"Sk",null,{"$f":"TEAMS!$F$39","v":0}]
[]
[2,null,"TOTAL SCORE",null,null,null,null,null,null,null,null,null,null,null,null,"TOTAL SCORE"]
[]
["Signature",null,null,null,null,null,null,null,null,null,null,null,null,"Signature"]
[]
[null,null,null,null,null,null,null,null,null,null,null,14]
[]
["Time Match Completed:-"]
[{"$f":"TEAMS!$D$1","v":"CLUB NAME"}]
[]
[{"$f":"TEAMS!$D$3","v":"Tuesday Mens Mufti."}]
[]
[null,null,"RINK",null,null,null,null,null,"DATE"]
[]
[null,null,{"$f":"TEAMS!$K$5","v":0},null,null,null,null,null,{"$f":"TEAMS!$D$2","v":"2011-03-07"}]
[]
[{"$f":"TEAMS!$L$6","v":0},null,null,null,null,null,null,null,null,null,null,"L",null,{"$f":"TEAMS!$J$6","v":0}]
[]
[{"$f":"TEAMS!$L$7","v":0},null,null,null,null,null,null,null,null,null,null,"S",null,{"$f":"TEAMS!$J$7","v":0}]
[]
[{"$f":"TEAMS!$L$8","v":0},null,null,null,null,null,null,null,null,null,null,"T",null,{"$f":"TEAMS!$J$8","v":0}]
[]
[{"$f":"TEAMS!$L$9","v":0},null,null,null,null,null,null,null,null,null,null,"Sk",null,{"$f":"TEAMS!$J$9","v":0}]
[]
[2,null,"TOTAL SCORE",null,null,null,null,null,null,null,null,null,null,null,null,"TOTAL SCORE"]
[]
["Signature",null,null,null,null,null,null,null,null,null,null,null,null,"Signature"]
[]
[null,null,null,null,null,null,null,null,null,null,null,15]
[]
["Time Match Completed:-"]
[{"$f":"TEAMS!$D$1","v":"CLUB NAME"}]
[]
[{"$f":"TEAMS!$D$3","v":"Tuesday Mens Mufti."}]
[]
[null,null,"RINK",null,null,null,null,null,"DATE"]
[]
[null,null,{"$f":"TEAMS!$K$10","v":0},null,null,null,null,null,{"$f":"TEAMS!$D$2","v":"2011-03-07"}]
[]
[{"$f":"TEAMS!$L$11","v":0},null,null,null,null,null,null,null,null,null,null,"L",null,{"$f":"TEAMS!$J$11","v":0}]
[]
[{"$f":"TEAMS!$L$12","v":0},null,null,null,null,null,null,null,null,null,null,"S",null,{"$f":"TEAMS!$J$12","v":0}]
[]
[{"$f":"TEAMS!$L$13","v":0},null,null,null,null,null,null,null,null,null,null,"T",null,{"$f":"TEAMS!$J$13","v":0}]
[]
[{"$f":"TEAMS!$L$14","v":0},null,null,null,null,null,null,null,null,null,null,"Sk",null,{"$f":"TEAMS!$J$14","v":0}]
[]
[2,null,"TOTAL SCORE",null,null,null,null,null,null,null,null,null,null,null,null,"TOTAL SCORE"]
[]
["Signature",null,null,null,null,null,null,null,null,null,null,null,null,"Signature"]
[]
[null,null,null,null,null,null,null,null,null,null,null,16]
[]
["Time Match Completed:-"]
[{"$f":"TEAMS!$D$1","v":"CLUB NAME"}]
[]
[{"$f":"TEAMS!$D$3","v":"Tuesday Mens Mufti."}]
[]
[null,null,"RINK",null,null,null,null,null,"DATE"]
[]
[null,null,{"$f":"TEAMS!$K$15","v":0},null,null,null,null,null,{"$f":"TEAMS!$D$2","v":"2011-03-07"}]
[]
[{"$f":"TEAMS!$L$16","v":0},null,null,null,null,null,null,null,null,null,null,"L",null,{"$f":"TEAMS!$J$16","v":0}]
[]
[{"$f":"TEAMS!$L$17","v":0},null,null,null,null,null,null,null,null,null,null,"S",null,{"$f":"TEAMS!$J$17","v":0}]
[]
[{"$f":"TEAMS!$L$18","v":0},null,null,null,null,null,null,null,null,null,null,"T",null,{"$f":"TEAMS!$J$18","v":0}]
[]
[{"$f":"TEAMS!$L$19","v":0},null,null,null,null,null,null,null,null,null,null,"Sk",null,{"$f":"TEAMS!$J$19","v":0}]
[]
[2,null,"TOTAL SCORE",null,null,null,null,null,null,null,null,null,null,null,null,"TOTAL SCORE"]
[]
["Signature",null,null,null,null,null,null,null,null,null,null,null,null,"Signature"]
[]
[null,null,null,null,null,null,null,null,null,null,null,17]
[]
["Time Match Completed:-"]
[{"$f":"TEAMS!$D$1","v":"CLUB NAME"}]
[]
[{"$f":"TEAMS!$D$3","v":"Tuesday Mens Mufti."}]
[]
[null,null,"RINK",null,null,null,null,null,"DATE"]
[]
[null,null,{"$f":"TEAMS!$K$20","v":0},null,null,null,null,null,{"$f":"TEAMS!$D$2","v":"2011-03-07"}]
[]
[{"$f":"TEAMS!$L$21","v":0},null,null,null,null,null,null,null,null,null,null,"L",null,{"$f":"TEAMS!$J$21","v":0}]
[]
[{"$f":"TEAMS!$L$22","v":0},null,null,null,null,null,null,null,null,null,null,"S",null,{"$f":"TEAMS!$J$22","v":0}]
[]
[{"$f":"TEAMS!$L$23","v":0},null,null,null,null,null,null,null,null,null,null,"T",null,{"$f":"TEAMS!$J$23","v":0}]
[]
[{"$f":"TEAMS!$L$24","v":0},null,null,null,null,null,null,null,null,null,null,"Sk",null,{"$f":"TEAMS!$J$24","v":0}]
[]
[2,null,"TOTAL SCORE",null,null,null,null,null,null,null,null,null,null,null,null,"TOTAL SCORE"]
[]
["Signature",null,null,null,null,null,null,null,null,null,null,null,null,"Signature"]
[]
[null,null,null,null,null,null,null,null,null,null,null,18]
[]
["Time Match Completed:-"]
[{"$f":"TEAMS!$D$1","v":"CLUB NAME"}]
[]
[{"$f":"TEAMS!$D$3","v":"Tuesday Mens Mufti."}]
[]
[null,null,"RINK",null,null,null,null,null,"DATE"]
[]
[null,null,{"$f":"TEAMS!$K$25","v":0},null,null,null,null,null,{"$f":"TEAMS!$D$2","v":"2011-03-07"}]
[]
[{"$f":"TEAMS!$L$26","v":0},null,null,null,null,null,null,null,null,null,null,"L",null,{"$f":"TEAMS!$J$26","v":0}]
[]
[{"$f":"TEAMS!$L$27","v":0},null,null,null,null,null,null,null,null,null,null,"S",null,{"$f":"TEAMS!$J$27","v":0}]
[]
[{"$f":"TEAMS!$L$28","v":0},null,null,null,null,null,null,null,null,null,null,"T",null,{"$f":"TEAMS!$J$28","v":0}]
[]
[{"$f":"TEAMS!$L$29","v":0},null,null,null,null,null,null,null,null,null,null,"Sk",null,{"$f":"TEAMS!$J$29","v":0}]
[]
[2,null,"TOTAL SCORE",null,null,null,null,null,null,null,null,null,null,null,null,"TOTAL SCORE"]
[]
["Signature",null,null,null,null,null,null,null,null,null,null,null,null,"Signature"]
[]
[null,null,null,null,null,null,null,null,null,null,null,19]
[]
["Time Match Completed:-"]
[{"$f":"TEAMS!$D$1","v":"CLUB NAME"}]
[]
[{"$f":"TEAMS!$D$3","v":"Tuesday Mens Mufti."}]
[]
[null,null,"RINK",null,null,null,null,null,"DATE"]
[]
[null,null,{"$f":"TEAMS!$K$30","v":0},null,null,null,null,null,{"$f":"TEAMS!$D$2","v":"2011-03-07"}]
[]
[{"$f":"TEAMS!$L$31","v":0},null,null,null,null,null,null,null,null,null,null,"L",null,{"$f":"TEAMS!$J$31","v":0}]
[]
[{"$f":"TEAMS!$L$32","v":0},null,null,null,null,null,null,null,null,null,null,"S",null,{"$f":"TEAMS!$J$32","v":0}]
[]
[{"$f":"TEAMS!$L$33","v":0},null,null,null,null,null,null,null,null,null,null,"T",null,{"$f":"TEAMS!$J$33","v":0}]
[]
[{"$f":"TEAMS!$L$34","v":0},null,null,null,null,null,null,null,null,null,null,"Sk",null,{"$f":"TEAMS!$J$34","v":0}]
[]
[2,null,"TOTAL SCORE",null,null,null,null,null,null,null,null,null,null,null,null,"TOTAL SCORE"]
[]
["Signature",null,null,null,null,null,null,null,null,null,null,null,null,"Signature"]
[]
[null,null,null,null,null,null,null,null,null,null,null,20]
[]
["Time Match Completed:-"]
[{"$f":"TEAMS!$D$1","v":"CLUB NAME"}]
[]
[{"$f":"TEAMS!$D$3","v":"Tuesday Mens Mufti."}]
[]
[null,null,"RINK",null,null,null,null,null,"DATE"]
[]
[null,null,{"$f":"TEAMS!$K$35","v":0},null,null,null,null,null,{"$f":"TEAMS!$D$2","v":"2011-03-07"}]
[]
[{"$f":"TEAMS!$L$36","v":0},null,null,null,null,null,null,null,null,null,null,"L",null,{"$f":"TEAMS!$J$36","v":0}]
[]
[{"$f":"TEAMS!$L$37","v":0},null,null,null,null,null,null,null,null,null,null,"S",null,{"$f":"TEAMS!$J$37","v":0}]
[]
[{"$f":"TEAMS!$L$38","v":0},null,null,null,null,null,null,null,null,null,null,"T",null,{"$f":"TEAMS!$J$38","v":0}]
[]
[{"$f":"TEAMS!$L$39","v":0},null,null,null,null,null,null,null,null,null,null,"Sk",null,{"$f":"TEAMS!$J$39","v":0}]
[]
[2,null,"TOTAL SCORE",null,null,null,null,null,null,null,null,null,null,null,null,"TOTAL SCORE"]
[]
["Signature",null,null,null,null,null,null,null,null,null,null,null,null,"Signature"]
[]
[null,null,null,null,null,null,null,null,null,null,null,21]
[]
["Time Match Completed:-"]
[{"$f":"TEAMS!$D$1","v":"CLUB NAME"}]
[]
[{"$f":"TEAMS!$D$3","v":"Tuesday Mens Mufti."}]
[]
[null,null,"RINK",null,null,null,null,null,"DATE"]
[]
[null,null,{"$f":"TEAMS!$O$5","v":0},null,null,null,null,null,{"$f":"TEAMS!$D$2","v":"2011-03-07"}]
[]
[{"$f":"TEAMS!$P$6","v":0},null,null,null,null,null,null,null,null,null,null,"L",null,{"$f":"TEAMS!$N$6","v":0}]
[]
[{"$f":"TEAMS!$P$7","v":0},null,null,null,null,null,null,null,null,null,null,"S",null,{"$f":"TEAMS!$N$7","v":0}]
[]
[{"$f":"TEAMS!$P$8","v":0},null,null,null,null,null,null,null,null,null,null,"T",null,{"$f":"TEAMS!$N$8","v":0}]
[]
[{"$f":"TEAMS!$P$9","v":0},null,null,null,null,null,null,null,null,null,null,"Sk",null,{"$f":"TEAMS!$N$9","v":0}]
[]
[2,null,"TOTAL SCORE",null,null,null,null,null,null,null,null,null,null,null,null,"TOTAL SCORE"]
[]
["Signature",null,null,null,null,null,null,null,null,null,null,null,null,"Signature"]
[]
[null,null,null,null,null,null,null,null,null,null,null,22]
[]
["Time Match Completed:-"]
[{"$f":"TEAMS!$D$1","v":"CLUB NAME"}]
[]
[{"$f":"TEAMS!$D$3","v":"Tuesday Mens Mufti."}]
[]
[null,null,"RINK",null,null,null,null,null,"DATE"]
[]
[null,null,{"$f":"TEAMS!$O$10","v":0},null,null,null,null,null,{"$f":"TEAMS!$D$2","v":"2011-03-07"}]
[]
[{"$f":"TEAMS!$P$11","v":0},null,null,null,null,null,null,null,null,null,null,"L",null,{"$f":"TEAMS!$N$11","v":0}]
[]
[{"$f":"TEAMS!$P$12","v":0},null,null,null,null,null,null,null,null,null,null,"S",null,{"$f":"TEAMS!$N$12","v":0}]
[]
[{"$f":"TEAMS!$P$13","v":0},null,null,null,null,null,null,null,null,null,null,"T",null,{"$f":"TEAMS!$N$13","v":0}]
[]
[{"$f":"TEAMS!$P$14","v":0},null,null,null,null,null,null,null,null,null,null,"Sk",null,{"$f":"TEAMS!$N$14","v":0}]
[]
[2,null,"TOTAL SCORE",null,null,null,null,null,null,null,null,null,null,null,null,"TOTAL SCORE"]
[]
["Signature",null,null,null,null,null,null,null,null,null,null,null,null,"Signature"]
[]
[null,null,null,null,null,null,null,null,null,null,null,23]
[]
["Time Match Completed:-"]
[{"$f":"TEAMS!$D$1","v":"CLUB NAME"}]
[]
[{"$f":"TEAMS!$D$3","v":"Tuesday Mens Mufti."}]
[]
[null,null,"RINK",null,null,null,null,null,"DATE"]
[]
[null,null,{"$f":"TEAMS!$O$15","v":0},null,null,null,null,null,{"$f":"TEAMS!$D$2","v":"2011-03-07"}]
[]
[{"$f":"TEAMS!$P$16","v":0},null,null,null,null,null,null,null,null,null,null,"L",null,{"$f":"TEAMS!$N$16","v":0}]
[]
[{"$f":"TEAMS!$P$17","v":0},null,null,null,null,null,null,null,null,null,null,"S",null,{"$f":"TEAMS!$N$17","v":0}]
[]
[{"$f":"TEAMS!$P$18","v":0},null,null,null,null,null,null,null,null,null,null,"T",null,{"$f":"TEAMS!$N$18","v":0}]
[]
[{"$f":"TEAMS!$P$19","v":0},null,null,null,null,null,null,null,null,null,null,"Sk",null,{"$f":"TEAMS!$N$19","v":0}]
[]
[2,null,"TOTAL SCORE",null,null,null,null,null,null,null,null,null,null,null,null,"TOTAL SCORE"]
[]
["Signature",null,null,null,null,null,null,null,null,null,null,null,null,"Signature"]
[]
[null,null,null,null,null,null,null,null,null,null,null,24]
[]
["Time Match Completed:-"]
[{"$f":"TEAMS!$D$1","v":"CLUB NAME"}]
[]
[{"$f":"TEAMS!$D$3","v":"Tuesday Mens Mufti."}]
[]
[null,null,"RINK",null,null,null,null,null,"DATE"]
[]
[null,null,{"$f":"TEAMS!$O$20","v":0},null,null,null,null,null,{"$f":"TEAMS!$D$2","v":"2011-03-07"}]
[]
[{"$f":"TEAMS!$P$21","v":0},null,null,null,null,null,null,null,null,null,null,"L",null,{"$f":"TEAMS!$N$21","v":0}]
[]
[{"$f":"TEAMS!$P$22","v":0},null,null,null,null,null,null,null,null,null,null,"S",null,{"$f":"TEAMS!$N$22","v":0}]
[]
[{"$f":"TEAMS!$P$23","v":0},null,null,null,null,null,null,null,null,null,null,"T",null,{"$f":"TEAMS!$N$23","v":0}]
[]
[{"$f":"TEAMS!$P$24","v":0},null,null,null,null,null,null,null,null,null,null,"Sk",null,{"$f":"TEAMS!$N$24","v":0}]
[]
[2,null,"TOTAL SCORE",null,null,null,null,null,null,null,null,null,null,null,null,"TOTAL SCORE"]
[]
["Signature",null,null,null,null,null,null,null,null,null,null,null,null,"Signature"]
[]
[null,null,null,null,null,null,null,null,null,null,null,25]
[]
["Time Match Completed:-"]
[{"$f":"TEAMS!$D$1","v":"CLUB NAME"}]
[]
[{"$f":"TEAMS!$D$3","v":"Tuesday Mens Mufti."}]
[]
[null,null,"RINK",null,null,null,null,null,"DATE"]
[]
[null,null,{"$f":"TEAMS!$O$25","v":0},null,null,null,null,null,{"$f":"TEAMS!$D$2","v":"2011-03-07"}]
[]
[{"$f":"TEAMS!$P$26","v":0},null,null,null,null,null,null,null,null,null,null,"L",null,{"$f":"TEAMS!$N$26","v":0}]
[]
[{"$f":"TEAMS!$P$27","v":0},null,null,null,null,null,null,null,null,null,null,"S",null,{"$f":"TEAMS!$N$27","v":0}]
[]
[{"$f":"TEAMS!$P$28","v":0},null,null,null,null,null,null,null,null,null,null,"T",null,{"$f":"TEAMS!$N$28","v":0}]
[]
[{"$f":"TEAMS!$P$29","v":0},null,null,null,null,null,null,null,null,null,null,"Sk",null,{"$f":"TEAMS!$N$29","v":0}]
[]
[2,null,"TOTAL SCORE",null,null,null,null,null,null,null,null,null,null,null,null,"TOTAL SCORE"]
[]
["Signature",null,null,null,null,null,null,null,null,null,null,null,null,"Signature"]
[]
[null,null,null,null,null,null,null,null,null,null,null,26]
[]
["Time Match Completed:-"]
[{"$f":"TEAMS!$D$1","v":"CLUB NAME"}]
[]
[{"$f":"TEAMS!$D$3","v":"Tuesday Mens Mufti."}]
[]
[null,null,"RINK",null,null,null,null,null,"DATE"]
[]
[null,null,{"$f":"TEAMS!$O$30","v":0},null,null,null,null,null,{"$f":"TEAMS!$D$2","v":"2011-03-07"}]
[]
[{"$f":"TEAMS!$P$31","v":0},null,null,null,null,null,null,null,null,null,null,"L",null,{"$f":"TEAMS!$N$31","v":0}]
[]
[{"$f":"TEAMS!$P$32","v":0},null,null,null,null,null,null,null,null,null,null,"S",null,{"$f":"TEAMS!$N$32","v":0}]
[]
[{"$f":"TEAMS!$P$33","v":0},null,null,null,null,null,null,null,null,null,null,"T",null,{"$f":"TEAMS!$N$33","v":0}]
[]
[{"$f":"TEAMS!$P$34","v":0},null,null,null,null,null,null,null,null,null,null,"Sk",null,{"$f":"TEAMS!$N$34","v":0}]
[]
[2,null,"TOTAL SCORE",null,null,null,null,null,null,null,null,null,null,null,null,"TOTAL SCORE"]
[]
["Signature",null,null,null,null,null,null,null,null,null,null,null,null,"Signature"]
[]
[null,null,null,null,null,null,null,null,null,null,null,27]
[]
["Time Match Completed:-"]
[{"$f":"TEAMS!$D$1","v":"CLUB NAME"}]
[]
[{"$f":"TEAMS!$D$3","v":"Tuesday Mens Mufti."}]
[]
[null,null,"RINK",null,null,null,null,null,"DATE"]
[]
[null,null,{"$f":"TEAMS!$O$35","v":0},null,null,null,null,null,{"$f":"TEAMS!$D$2","v":"2011-03-07"}]
[]
[{"$f":"TEAMS!$P$36","v":0},null,null,null,null,null,null,null,null,null,null,"L",null,{"$f":"TEAMS!$N$36","v":0}]
[]
[{"$f":"TEAMS!$P$37","v":0},null,null,null,null,null,null,null,null,null,null,"S",null,{"$f":"TEAMS!$N$37","v":0}]
[]
[{"$f":"TEAMS!$P$38","v":0},null,null,null,null,null,null,null,null,null,null,"T",null,{"$f":"TEAMS!$N$38","v":0}]
[]
[{"$f":"TEAMS!$P$39","v":0},null,null,null,null,null,null,null,null,null,null,"Sk",null,{"$f":"TEAMS!$N$39","v":0}]
[]
[2,null,"TOTAL SCORE",null,null,null,null,null,null,null,null,null,null,null,null,"TOTAL SCORE"]
[]
["Signature",null,null,null,null,null,null,null,null,null,null,null,null,"Signature"]
[]
[null,null,null,null,null,null,null,null,null,null,null,28]
[]
["Time Match Completed:-"]

{"sheet":"CARDS REAR","index":11,"n_rows":493,"n_cols":10,"rows_kept":493,"cut":false,"hidden":false,"merged":[[0,0,0,1],[0,5,0,9],[17,0,17,1],[17,5,17,9],[2,1,2,2],[2,3,2,4],[2,6,2,7],[2,8,2,9],[36,1,36,2],[36,3,36,4],[36,6,36,7],[36,8,36,9],[19,6,19,7],[19,8,19,9],[19,1,19,2],[19,3,19,4],[34,0,34,1],[34,5,34,9],[68,0,68,1],[68,5,68,9],[70,1,70,2],[70,3,70,4],[70,6,70,7],[70,8,70,9],[51,0,51,1],[51,5,51,9],[53,1,53,2],[53,3,53,4],[53,6,53,7],[53,8,53,9],[102,0,102,1],[102,5,102,9],[104,1,104,2],[104,3,104,4],[104,6,104,7],[104,8,104,9],[85,0,85,1],[85,5,85,9],[87,1,87,2],[87,3,87,4],[87,6,87,7],[87,8,87,9],[136,0,136,1],[136,5,136,9],[138,1,138,2],[138,3,138,4],[138,6,138,7],[138,8,138,9],[119,0,119,1],[119,5,119,9],[121,1,121,2],[121,3,121,4],[121,6,121,7],[121,8,121,9],[170,0,170,1],[170,5,170,9],[172,1,172,2],[172,3,172,4],[172,6,172,7],[172,8,172,9],[153,0,153,1],[153,5,153,9],[155,1,155,2],[155,3,155,4],[155,6,155,7],[155,8,155,9],[204,0,204,1],[204,5,204,9],[206,1,206,2],[206,3,206,4],[206,6,206,7],[206,8,206,9],[187,0,187,1],[187,5,187,9],[189,1,189,2],[189,3,189,4],[189,6,189,7],[189,8,189,9],[238,0,238,1],[238,5,238,9],[240,1,240,2],[240,3,240,4],[240,6,240,7],[240,8,240,9],[221,0,221,1],[221,5,221,9],[223,1,223,2],[223,3,223,4],[223,6,223,7],[223,8,223,9],[272,0,272,1],[272,5,272,9],[274,1,274,2],[274,3,274,4],[274,6,274,7],[274,8,274,9],[255,0,255,1],[255,5,255,9],[257,1,257,2],[257,3,257,4],[257,6,257,7],[257,8,257,9],[306,0,306,1],[306,5,306,9],[308,1,308,2],[308,3,308,4],[308,6,308,7],[308,8,308,9],[289,0,289,1],[289,5,289,9],[291,1,291,2],[291,3,291,4],[291,6,291,7],[291,8,291,9],[340,0,340,1],[340,5,340,9],[342,1,342,2],[342,3,342,4],[342,6,342,7],[342,8,342,9],[323,0,323,1],[323,5,323,9],[325,1,325,2],[325,3,325,4],[325,6,325,7],[325,8,325,9],[374,0,374,1],[374,5,374,9],[376,1,376,2],[376,3,376,4],[376,6,376,7],[376,8,376,9],[357,0,357,1],[357,5,357,9],[359,1,359,2],[359,3,359,4],[359,6,359,7],[359,8,359,9],[408,0,408,1],[408,5,408,9],[410,1,410,2],[410,3,410,4],[410,6,410,7],[410,8,410,9],[391,0,391,1],[391,5,391,9],[393,1,393,2],[393,3,393,4],[393,6,393,7],[393,8,393,9],[442,0,442,1],[442,5,442,9],[444,1,444,2],[444,3,444,4],[444,6,444,7],[444,8,444,9],[425,0,425,1],[425,5,425,9],[427,1,427,2],[427,3,427,4],[427,6,427,7],[427,8,427,9],[476,0,476,1],[476,5,476,9],[478,1,478,2],[478,3,478,4],[478,6,478,7],[478,8,478,9],[459,0,459,1],[459,5,459,9],[461,1,461,2],[461,3,461,4],[461,6,461,7],[461,8,461,9]]}
["RINK",null,{"$f":"CARDS!$C$7","v":0},null,"SKIP",{"$f":"CARDS!$A$15","v":0}]
[1]
[null,{"$f":"CARDS!$A$15","v":0},null,{"$f":"CARDS!$N$15","v":0},null,null,{"$f":"CARDS!$A$15","v":0},null,{"$f":"CARDS!$N$15","v":0}]
["End","Shots","Total","Shots","Total","End","Shots","Total","Shots","Total"]
[1,null,null,null,null,14]
[2,null,null,null,null,15]
[3,null,null,null,null,16]
[4,null,null,null,null,17]
[5,null,null,null,null,18]
[6,null,null,null,null,19]
[7,null,null,null,null,20]
[8,null,null,null,null,21]
[9,null,null,null,null,22]
[10,null,null,null,null,23]
[11,null,null,null,null,24]
[12,null,null,null,null,25]
[13,null,null,null,null,"T"]
["RINK",null,{"$f":"CARDS!$C$30","v":0},null,"SKIP",{"$f":"CARDS!$A$38","v":0}]
[1]
[null,{"$f":"CARDS!$A$38","v":0},null,{"$f":"CARDS!$N$38","v":0},null,null,{"$f":"CARDS!$A$38","v":0},null,{"$f":"CARDS!$N$38","v":0}]
["End","Shots","Total","Shots","Total","End","Shots","Total","Shots","Total"]
[1,null,null,null,null,14]
[2,null,null,null,null,15]
[3,null,null,null,null,16]
[4,null,null,null,null,17]
[5,null,null,null,null,18]
[6,null,null,null,null,19]
[7,null,null,null,null,20]
[8,null,null,null,null,21]
[9,null,null,null,null,22]
[10,null,null,null,null,23]
[11,null,null,null,null,24]
[12,null,null,null,null,25]
[13,null,null,null,null,"T"]
["RINK",null,{"$f":"CARDS!$C$53","v":0},null,"SKIP",{"$f":"CARDS!$A$61","v":0}]
[1]
[null,{"$f":"CARDS!$A$61","v":0},null,{"$f":"CARDS!$N$61","v":0},null,null,{"$f":"CARDS!$A$61","v":0},null,{"$f":"CARDS!$N$61","v":0}]
["End","Shots","Total","Shots","Total","End","Shots","Total","Shots","Total"]
[1,null,null,null,null,14]
[2,null,null,null,null,15]
[3,null,null,null,null,16]
[4,null,null,null,null,17]
[5,null,null,null,null,18]
[6,null,null,null,null,19]
[7,null,null,null,null,20]
[8,null,null,null,null,21]
[9,null,null,null,null,22]
[10,null,null,null,null,23]
[11,null,null,null,null,24]
[12,null,null,null,null,25]
[13,null,null,null,null,"T"]
["RINK",null,{"$f":"CARDS!$C$76","v":0},null,"SKIP",{"$f":"CARDS!$A$84","v":0}]
[1]
[null,{"$f":"CARDS!$A$84","v":0},null,{"$f":"CARDS!$N$84","v":0},null,null,{"$f":"CARDS!$A$84","v":0},null,{"$f":"CARDS!$N$84","v":0}]
["End","Shots","Total","Shots","Total","End","Shots","Total","Shots","Total"]
[1,null,null,null,null,14]
[2,null,null,null,null,15]
[3,null,null,null,null,16]
[4,null,null,null,null,17]
[5,null,null,null,null,18]
[6,null,null,null,null,19]
[7,null,null,null,null,20]
[8,null,null,null,null,21]
[9,null,null,null,null,22]
[10,null,null,null,null,23]
[11,null,null,null,null,24]
[12,null,null,null,null,25]
[13,null,null,null,null,"T"]
["RINK",null,{"$f":"CARDS!$C$99","v":0},null,"SKIP",{"$f":"CARDS!$A$107","v":0}]
[1]
[null,{"$f":"CARDS!$A$107","v":0},null,{"$f":"CARDS!$N$107","v":0},null,null,{"$f":"CARDS!$A$107","v":0},null,{"$f":"CARDS!$N$107","v":0}]
["End","Shots","Total","Shots","Total","End","Shots","Total","Shots","Total"]
[1,null,null,null,null,14]
[2,null,null,null,null,15]
[3,null,null,null,null,16]
[4,null,null,null,null,17]
[5,null,null,null,null,18]
[6,null,null,null,null,19]
[7,null,null,null,null,20]
[8,null,null,null,null,21]
[9,null,null,null,null,22]
[10,null,null,null,null,23]
[11,null,null,null,null,24]
[12,null,null,null,null,25]
[13,null,null,null,null,"T"]
["RINK",null,{"$f":"CARDS!$C$122","v":0},null,"SKIP",{"$f":"CARDS!$A$130","v":0}]
[1]
[null,{"$f":"CARDS!$A$130","v":0},null,{"$f":"CARDS!$N$130","v":0},null,null,{"$f":"CARDS!$A$130","v":0},null,{"$f":"CARDS!$N$130","v":0}]
["End","Shots","Total","Shots","Total","End","Shots","Total","Shots","Total"]
[1,null,null,null,null,14]
[2,null,null,null,null,15]
[3,null,null,null,null,16]
[4,null,null,null,null,17]
[5,null,null,null,null,18]
[6,null,null,null,null,19]
[7,null,null,null,null,20]
[8,null,null,null,null,21]
[9,null,null,null,null,22]
[10,null,null,null,null,23]
[11,null,null,null,null,24]
[12,null,null,null,null,25]
[13,null,null,null,null,"T"]
["RINK",null,{"$f":"CARDS!$C$145","v":0},null,"SKIP",{"$f":"CARDS!$A$153","v":0}]
[1]
[null,{"$f":"CARDS!$A$153","v":0},null,{"$f":"CARDS!$N$153","v":0},null,null,{"$f":"CARDS!$A$153","v":0},null,{"$f":"CARDS!$N$153","v":0}]
["End","Shots","Total","Shots","Total","End","Shots","Total","Shots","Total"]
[1,null,null,null,null,14]
[2,null,null,null,null,15]
[3,null,null,null,null,16]
[4,null,null,null,null,17]
[5,null,null,null,null,18]
[6,null,null,null,null,19]
[7,null,null,null,null,20]
[8,null,null,null,null,21]
[9,null,null,null,null,22]
[10,null,null,null,null,23]
[11,null,null,null,null,24]
[12,null,null,null,null,25]
[13,null,null,null,null,"T"]
["RINK",null,{"$f":"CARDS!$C$168","v":0},null,"SKIP",{"$f":"CARDS!$A$176","v":0}]
[1]
[null,{"$f":"CARDS!$A$176","v":0},null,{"$f":"CARDS!$N$176","v":0},null,null,{"$f":"CARDS!$A$176","v":0},null,{"$f":"CARDS!$N$176","v":0}]
["End","Shots","Total","Shots","Total","End","Shots","Total","Shots","Total"]
[1,null,null,null,null,14]
[2,null,null,null,null,15]
[3,null,null,null,null,16]
[4,null,null,null,null,17]
[5,null,null,null,null,18]
[6,null,null,null,null,19]
[7,null,null,null,null,20]
[8,null,null,null,null,21]
[9,null,null,null,null,22]
[10,null,null,null,null,23]
[11,null,null,null,null,24]
[12,null,null,null,null,25]
[13,null,null,null,null,"T"]
["RINK",null,{"$f":"CARDS!$C$191","v":0},null,"SKIP",{"$f":"CARDS!$A$199","v":0}]
[1]
[null,{"$f":"CARDS!$A$199","v":0},null,{"$f":"CARDS!$N$199","v":0},null,null,{"$f":"CARDS!$A$199","v":0},null,{"$f":"CARDS!$N$199","v":0}]
["End","Shots","Total","Shots","Total","End","Shots","Total","Shots","Total"]
[1,null,null,null,null,14]
[2,null,null,null,null,15]
[3,null,null,null,null,16]
[4,null,null,null,null,17]
[5,null,null,null,null,18]
[6,null,null,null,null,19]
[7,null,null,null,null,20]
[8,null,null,null,null,21]
[9,null,null,null,null,22]
[10,null,null,null,null,23]
[11,null,null,null,null,24]
[12,null,null,null,null,25]
[13,null,null,null,null,"T"]
["RINK",null,{"$f":"CARDS!$C$214","v":0},null,"SKIP",{"$f":"CARDS!$A$222","v":0}]
[1]
[null,{"$f":"CARDS!$A$222","v":0},null,{"$f":"CARDS!$N$222","v":0},null,null,{"$f":"CARDS!$A$222","v":0},null,{"$f":"CARDS!$N$222","v":0}]
["End","Shots","Total","Shots","Total","End","Shots","Total","Shots","Total"]
[1,null,null,null,null,14]
[2,null,null,null,null,15]
[3,null,null,null,null,16]
[4,null,null,null,null,17]
[5,null,null,null,null,18]
[6,null,null,null,null,19]
[7,null,null,null,null,20]
[8,null,null,null,null,21]
[9,null,null,null,null,22]
[10,null,null,null,null,23]
[11,null,null,null,null,24]
[12,null,null,null,null,25]
[13,null,null,null,null,"T"]
["RINK",null,{"$f":"CARDS!$C$237","v":0},null,"SKIP",{"$f":"CARDS!$A$245","v":0}]
[1]
[null,{"$f":"CARDS!$A$245","v":0},null,{"$f":"CARDS!$N$245","v":0},null,null,{"$f":"CARDS!$A$245","v":0},null,{"$f":"CARDS!$N$245","v":0}]
["End","Shots","Total","Shots","Total","End","Shots","Total","Shots","Total"]
[1,null,null,null,null,14]
[2,null,null,null,null,15]
[3,null,null,null,null,16]
[4,null,null,null,null,17]
[5,null,null,null,null,18]
[6,null,null,null,null,19]
[7,null,null,null,null,20]
[8,null,null,null,null,21]
[9,null,null,null,null,22]
[10,null,null,null,null,23]
[11,null,null,null,null,24]
[12,null,null,null,null,25]
[13,null,null,null,null,"T"]
["RINK",null,{"$f":"CARDS!$C$260","v":0},null,"SKIP",{"$f":"CARDS!$A$268","v":0}]
[1]
[null,{"$f":"CARDS!$A$268","v":0},null,{"$f":"CARDS!$N$268","v":0},null,null,{"$f":"CARDS!$A$268","v":0},null,{"$f":"CARDS!$N$268","v":0}]
["End","Shots","Total","Shots","Total","End","Shots","Total","Shots","Total"]
[1,null,null,null,null,14]
[2,null,null,null,null,15]
[3,null,null,null,null,16]
[4,null,null,null,null,17]
[5,null,null,null,null,18]
[6,null,null,null,null,19]
[7,null,null,null,null,20]
[8,null,null,null,null,21]
[9,null,null,null,null,22]
[10,null,null,null,null,23]
[11,null,null,null,null,24]
[12,null,null,null,null,25]
[13,null,null,null,null,"T"]
["RINK",null,{"$f":"CARDS!$C$283","v":0},null,"SKIP",{"$f":"CARDS!$A$291","v":0}]
[1]
[null,{"$f":"CARDS!$A$291","v":0},null,{"$f":"CARDS!$N$291","v":0},null,null,{"$f":"CARDS!$A$291","v":0},null,{"$f":"CARDS!$N$291","v":0}]
["End","Shots","Total","Shots","Total","End","Shots","Total","Shots","Total"]
[1,null,null,null,null,14]
[2,null,null,null,null,15]
[3,null,null,null,null,16]
[4,null,null,null,null,17]
[5,null,null,null,null,18]
[6,null,null,null,null,19]
[7,null,null,null,null,20]
[8,null,null,null,null,21]
[9,null,null,null,null,22]
[10,null,null,null,null,23]
[11,null,null,null,null,24]
[12,null,null,null,null,25]
[13,null,null,null,null,"T"]
["RINK",null,{"$f":"CARDS!$C$306","v":0},null,"SKIP",{"$f":"CARDS!$A$314","v":0}]
[1]
[null,{"$f":"CARDS!$A$314","v":0},null,{"$f":"CARDS!$N$314","v":0},null,null,{"$f":"CARDS!$A$314","v":0},null,{"$f":"CARDS!$N$314","v":0}]
["End","Shots","Total","Shots","Total","End","Shots","Total","Shots","Total"]
[1,null,null,null,null,14]
[2,null,null,null,null,15]
[3,null,null,null,null,16]
[4,null,null,null,null,17]
[5,null,null,null,null,18]
[6,null,null,null,null,19]
[7,null,null,null,null,20]
[8,null,null,null,null,21]
[9,null,null,null,null,22]
[10,null,null,null,null,23]
[11,null,null,null,null,24]
[12,null,null,null,null,25]
[13,null,null,null,null,"T"]
["RINK",null,{"$f":"CARDS!$C$329","v":0},null,"SKIP",{"$f":"CARDS!$A$337","v":0}]
[1]
[null,{"$f":"CARDS!$A$337","v":0},null,{"$f":"CARDS!$N$337","v":0},null,null,{"$f":"CARDS!$A$337","v":0},null,{"$f":"CARDS!$N$337","v":0}]
["End","Shots","Total","Shots","Total","End","Shots","Total","Shots","Total"]
[1,null,null,null,null,14]
[2,null,null,null,null,15]
[3,null,null,null,null,16]
[4,null,null,null,null,17]
[5,null,null,null,null,18]
[6,null,null,null,null,19]
[7,null,null,null,null,20]
[8,null,null,null,null,21]
[9,null,null,null,null,22]
[10,null,null,null,null,23]
[11,null,null,null,null,24]
[12,null,null,null,null,25]
[13,null,null,null,null,"T"]
["RINK",null,{"$f":"CARDS!$C$352","v":0},null,"SKIP",{"$f":"CARDS!$A$360","v":0}]
[1]
[null,{"$f":"CARDS!$A$360","v":0},null,{"$f":"CARDS!$N$360","v":0},null,null,{"$f":"CARDS!$A$360","v":0},null,{"$f":"CARDS!$N$360","v":0}]
["End","Shots","Total","Shots","Total","End","Shots","Total","Shots","Total"]
[1,null,null,null,null,14]
[2,null,null,null,null,15]
[3,null,null,null,null,16]
[4,null,null,null,null,17]
[5,null,null,null,null,18]
[6,null,null,null,null,19]
[7,null,null,null,null,20]
[8,null,null,null,null,21]
[9,null,null,null,null,22]
[10,null,null,null,null,23]
[11,null,null,null,null,24]
[12,null,null,null,null,25]
[13,null,null,null,null,"T"]
["RINK",null,{"$f":"CARDS!$C$375","v":0},null,"SKIP",{"$f":"CARDS!$A$383","v":0}]
[1]
[null,{"$f":"CARDS!$A$383","v":0},null,{"$f":"CARDS!$N$383","v":0},null,null,{"$f":"CARDS!$A$383","v":0},null,{"$f":"CARDS!$N$383","v":0}]
["End","Shots","Total","Shots","Total","End","Shots","Total","Shots","Total"]
[1,null,null,null,null,14]
[2,null,null,null,null,15]
[3,null,null,null,null,16]
[4,null,null,null,null,17]
[5,null,null,null,null,18]
[6,null,null,null,null,19]
[7,null,null,null,null,20]
[8,null,null,null,null,21]
[9,null,null,null,null,22]
[10,null,null,null,null,23]
[11,null,null,null,null,24]
[12,null,null,null,null,25]
[13,null,null,null,null,"T"]
["RINK",null,{"$f":"CARDS!$C$398","v":0},null,"SKIP",{"$f":"CARDS!$A$406","v":0}]
[1]
[null,{"$f":"CARDS!$A$406","v":0},null,{"$f":"CARDS!$N$406","v":0},null,null,{"$f":"CARDS!$A$406","v":0},null,{"$f":"CARDS!$N$406","v":0}]
["End","Shots","Total","Shots","Total","End","Shots","Total","Shots","Total"]
[1,null,null,null,null,14]
[2,null,null,null,null,15]
[3,null,null,null,null,16]
[4,null,null,null,null,17]
[5,null,null,null,null,18]
[6,null,null,null,null,19]
[7,null,null,null,null,20]
[8,null,null,null,null,21]
[9,null,null,null,null,22]
[10,null,null,null,null,23]
[11,null,null,null,null,24]
[12,null,null,null,null,25]
[13,null,null,null,null,"T"]
["RINK",null,{"$f":"CARDS!$C$421","v":0},null,"SKIP",{"$f":"CARDS!$A$429","v":0}]
[1]
[null,{"$f":"CARDS!$A$429","v":0},null,{"$f":"CARDS!$N$429","v":0},null,null,{"$f":"CARDS!$A$429","v":0},null,{"$f":"CARDS!$N$429","v":0}]
["End","Shots","Total","Shots","Total","End","Shots","Total","Shots","Total"]
[1,null,null,null,null,14]
[2,null,null,null,null,15]
[3,null,null,null,null,16]
[4,null,null,null,null,17]
[5,null,null,null,null,18]
[6,null,null,null,null,19]
[7,null,null,null,null,20]
[8,null,null,null,null,21]
[9,null,null,null,null,22]
[10,null,null,null,null,23]
[11,null,null,null,null,24]
[12,null,null,null,null,25]
[13,null,null,null,null,"T"]
["RINK",null,{"$f":"CARDS!$C$444","v":0},null,"SKIP",{"$f":"CARDS!$A$452","v":0}]
[1]
[null,{"$f":"CARDS!$A$452","v":0},null,{"$f":"CARDS!$N$452","v":0},null,null,{"$f":"CARDS!$A$452","v":0},null,{"$f":"CARDS!$N$452","v":0}]
["End","Shots","Total","Shots","Total","End","Shots","Total","Shots","Total"]
[1,null,null,null,null,14]
[2,null,null,null,null,15]
[3,null,null,null,null,16]
[4,null,null,null,null,17]
[5,null,null,null,null,18]
[6,null,null,null,null,19]
[7,null,null,null,null,20]
[8,null,null,null,null,21]
[9,null,null,null,null,22]
[10,null,null,null,null,23]
[11,null,null,null,null,24]
[12,null,null,null,null,25]
[13,null,null,null,null,"T"]
["RINK",null,{"$f":"CARDS!$C$467","v":0},null,"SKIP",{"$f":"CARDS!$A$475","v":0}]
[1]
[null,{"$f":"CARDS!$A$475","v":0},null,{"$f":"CARDS!$N$475","v":0},null,null,{"$f":"CARDS!$A$475","v":0},null,{"$f":"CARDS!$N$475","v":0}]
["End","Shots","Total","Shots","Total","End","Shots","Total","Shots","Total"]
[1,null,null,null,null,14]
[2,null,null,null,null,15]
[3,null,null,null,null,16]
[4,null,null,null,null,17]
[5,null,null,null,null,18]
[6,null,null,null,null,19]
[7,null,null,null,null,20]
[8,null,null,null,null,21]
[9,null,null,null,null,22]
[10,null,null,null,null,23]
[11,null,null,null,null,24]
[12,null,null,null,null,25]
[13,null,null,null,null,"T"]
["RINK",null,{"$f":"CARDS!$C$490","v":0},null,"SKIP",{"$f":"CARDS!$A$498","v":0}]
[1]
[null,{"$f":"CARDS!$A$498","v":0},null,{"$f":"CARDS!$N$498","v":0},null,null,{"$f":"CARDS!$A$498","v":0},null,{"$f":"CARDS!$N$498","v":0}]
["End","Shots","Total","Shots","Total","End","Shots","Total","Shots","Total"]
[1,null,null,null,null,14]
[2,null,null,null,null,15]
[3,null,null,null,null,16]
[4,null,null,null,null,17]
[5,null,null,null,null,18]
[6,null,null,null,null,19]
[7,null,null,null,null,20]
[8,null,null,null,null,21]
[9,null,null,null,null,22]
[10,null,null,null,null,23]
[11,null,null,null,null,24]
[12,null,null,null,null,25]
[13,null,null,null,null,"T"]
["RINK",null,{"$f":"CARDS!$C$513","v":0},null,"SKIP",{"$f":"CARDS!$A$521","v":0}]
[1]
[null,{"$f":"CARDS!$A$521","v":0},null,{"$f":"CARDS!$N$521","v":0},null,null,{"$f":"CARDS!$A$521","v":0},null,{"$f":"CARDS!$N$521","v":0}]
["End","Shots","Total","Shots","Total","End","Shots","Total","Shots","Total"]
[1,null,null,null,null,14]
[2,null,null,null,null,15]
[3,null,null,null,null,16]
[4,null,null,null,null,17]
[5,null,null,null,null,18]
[6,null,null,null,null,19]
[7,null,null,null,null,20]
[8,null,null,null,null,21]
[9,null,null,null,null,22]
[10,null,null,null,null,23]
[11,null,null,null,null,24]
[12,null,null,null,null,25]
[13,null,null,null,null,"T"]
["RINK",null,{"$f":"CARDS!$C$536","v":0},null,"SKIP",{"$f":"CARDS!$A$544","v":0}]
[1]
[null,{"$f":"CARDS!$A$544","v":0},null,{"$f":"CARDS!$N$544","v":0},null,null,{"$f":"CARDS!$A$544","v":0},null,{"$f":"CARDS!$N$544","v":0}]
["End","Shots","Total","Shots","Total","End","Shots","Total","Shots","Total"]
[1,null,null,null,null,14]
[2,null,null,null,null,15]
[3,null,null,null,null,16]
[4,null,null,null,null,17]
[5,null,null,null,null,18]
[6,null,null,null,null,19]
[7,null,null,null,null,20]
[8,null,null,null,null,21]
[9,null,null,null,null,22]
[10,null,null,null,null,23]
[11,null,null,null,null,24]
[12,null,null,null,null,25]
[13,null,null,null,null,"T"]
["RINK",null,{"$f":"CARDS!$C$559","v":0},null,"SKIP",{"$f":"CARDS!$A$567","v":0}]
[1]
[null,{"$f":"CARDS!$A$567","v":0},null,{"$f":"CARDS!$N$567","v":0},null,null,{"$f":"CARDS!$A$567","v":0},null,{"$f":"CARDS!$N$567","v":0}]
["End","Shots","Total","Shots","Total","End","Shots","Total","Shots","Total"]
[1,null,null,null,null,14]
[2,null,null,null,null,15]
[3,null,null,null,null,16]
[4,null,null,null,null,17]
[5,null,null,null,null,18]
[6,null,null,null,null,19]
[7,null,null,null,null,20]
[8,null,null,null,null,21]
[9,null,null,null,null,22]
[10,null,null,null,null,23]
[11,null,null,null,null,24]
[12,null,null,null,null,25]
[13,null,null,null,null,"T"]
["RINK",null,{"$f":"CARDS!$C$582","v":0},null,"SKIP",{"$f":"CARDS!$A$590","v":0}]
[1]
[null,{"$f":"CARDS!$A$590","v":0},null,{"$f":"CARDS!$N$590","v":0},null,null,{"$f":"CARDS!$A$590","v":0},null,{"$f":"CARDS!$N$590","v":0}]
["End","Shots","Total","Shots","Total","End","Shots","Total","Shots","Total"]
[1,null,null,null,null,14]
[2,null,null,null,null,15]
[3,null,null,null,null,16]
[4,null,null,null,null,17]
[5,null,null,null,null,18]
[6,null,null,null,null,19]
[7,null,null,null,null,20]
[8,null,null,null,null,21]
[9,null,null,null,null,22]
[10,null,null,null,null,23]
[11,null,null,null,null,24]
[12,null,null,null,null,25]
[13,null,null,null,null,"T"]
["RINK",null,{"$f":"CARDS!$C$605","v":0},null,"SKIP",{"$f":"CARDS!$A$613","v":0}]
[1]
[null,{"$f":"CARDS!$A$613","v":0},null,{"$f":"CARDS!$N$613","v":0},null,null,{"$f":"CARDS!$A$613","v":0},null,{"$f":"CARDS!$N$613","v":0}]
["End","Shots","Total","Shots","Total","End","Shots","Total","Shots","Total"]
[1,null,null,null,null,14]
[2,null,null,null,null,15]
[3,null,null,null,null,16]
[4,null,null,null,null,17]
[5,null,null,null,null,18]
[6,null,null,null,null,19]
[7,null,null,null,null,20]
[8,null,null,null,null,21]
[9,null,null,null,null,22]
[10,null,null,null,null,23]
[11,null,null,null,null,24]
[12,null,null,null,null,25]
[13,null,null,null,null,"T"]
["RINK",null,{"$f":"CARDS!$C$628","v":0},null,"SKIP",{"$f":"CARDS!$A$636","v":0}]
[1]
[null,{"$f":"CARDS!$A$636","v":0},null,{"$f":"CARDS!$N$636","v":0},null,null,{"$f":"CARDS!$A$636","v":0},null,{"$f":"CARDS!$N$636","v":0}]
["End","Shots","Total","Shots","Total","End","Shots","Total","Shots","Total"]
[1,null,null,null,null,14]
[2,null,null,null,null,15]
[3,null,null,null,null,16]
[4,null,null,null,null,17]
[5,null,null,null,null,18]
[6,null,null,null,null,19]
[7,null,null,null,null,20]
[8,null,null,null,null,21]
[9,null,null,null,null,22]
[10,null,null,null,null,23]
[11,null,null,null,null,24]
[12,null,null,null,null,25]
[13,null,null,null,null,"T"]
["RINK",null,null,null,"SKIP"]
[1]
[]
["End","Shots","Total","Shots","Total","End","Shots","Total","Shots","Total"]
[1,null,null,null,null,14]
[2,null,null,null,null,15]
[3,null,null,null,null,16]
[4,null,null,null,null,17]
[5,null,null,null,null,18]
[6,null,null,null,null,19]
[7,null,null,null,null,20]
[8,null,null,null,null,21]
[9,null,null,null,null,22]
[10,null,null,null,null,23]
[11,null,null,null,null,24]
[12,null,null,null,null,25]
[13,null,null,null,null,"T"]

{"sheet":"CARDS 2 REAR","index":12,"n_rows":493,"n_cols":10,"rows_kept":493,"cut":false,"hidden":false,"merged":[[0,0,0,1],[0,5,0,9],[2,1,2,2],[2,3,2,4],[2,6,2,7],[2,8,2,9],[34,0,34,1],[34,5,34,9],[36,1,36,2],[36,3,36,4],[36,6,36,7],[36,8,36,9],[17,0,17,1],[17,5,17,9],[19,1,19,2],[19,3,19,4],[19,6,19,7],[19,8,19,9],[68,0,68,1],[68,5,68,9],[70,1,70,2],[70,3,70,4],[70,6,70,7],[70,8,70,9],[51,0,51,1],[51,5,51,9],[53,1,53,2],[53,3,53,4],[53,6,53,7],[53,8,53,9],[102,0,102,1],[102,5,102,9],[104,1,104,2],[104,3,104,4],[104,6,104,7],[104,8,104,9],[85,0,85,1],[85,5,85,9],[87,1,87,2],[87,3,87,4],[87,6,87,7],[87,8,87,9],[136,0,136,1],[136,5,136,9],[138,1,138,2],[138,3,138,4],[138,6,138,7],[138,8,138,9],[119,0,119,1],[119,5,119,9],[121,1,121,2],[121,3,121,4],[121,6,121,7],[121,8,121,9],[170,0,170,1],[170,5,170,9],[172,1,172,2],[172,3,172,4],[172,6,172,7],[172,8,172,9],[153,0,153,1],[153,5,153,9],[155,1,155,2],[155,3,155,4],[155,6,155,7],[155,8,155,9],[204,0,204,1],[204,5,204,9],[206,1,206,2],[206,3,206,4],[206,6,206,7],[206,8,206,9],[187,0,187,1],[187,5,187,9],[189,1,189,2],[189,3,189,4],[189,6,189,7],[189,8,189,9],[238,0,238,1],[238,5,238,9],[240,1,240,2],[240,3,240,4],[240,6,240,7],[240,8,240,9],[221,0,221,1],[221,5,221,9],[223,1,223,2],[223,3,223,4],[223,6,223,7],[223,8,223,9],[272,0,272,1],[272,5,272,9],[274,1,274,2],[274,3,274,4],[274,6,274,7],[274,8,274,9],[255,0,255,1],[255,5,255,9],[257,1,257,2],[257,3,257,4],[257,6,257,7],[257,8,257,9],[306,0,306,1],[306,5,306,9],[308,1,308,2],[308,3,308,4],[308,6,308,7],[308,8,308,9],[289,0,289,1],[289,5,289,9],[291,1,291,2],[291,3,291,4],[291,6,291,7],[291,8,291,9],[340,0,340,1],[340,5,340,9],[342,1,342,2],[342,3,342,4],[342,6,342,7],[342,8,342,9],[323,0,323,1],[323,5,323,9],[325,1,325,2],[325,3,325,4],[325,6,325,7],[325,8,325,9],[374,0,374,1],[374,5,374,9],[376,1,376,2],[376,3,376,4],[376,6,376,7],[376,8,376,9],[357,0,357,1],[357,5,357,9],[359,1,359,2],[359,3,359,4],[359,6,359,7],[359,8,359,9],[408,0,408,1],[408,5,408,9],[410,1,410,2],[410,3,410,4],[410,6,410,7],[410,8,410,9],[391,0,391,1],[391,5,391,9],[393,1,393,2],[393,3,393,4],[393,6,393,7],[393,8,393,9],[442,0,442,1],[442,5,442,9],[444,1,444,2],[444,3,444,4],[444,6,444,7],[444,8,444,9],[425,0,425,1],[425,5,425,9],[427,1,427,2],[427,3,427,4],[427,6,427,7],[427,8,427,9],[476,0,476,1],[476,5,476,9],[478,1,478,2],[478,3,478,4],[478,6,478,7],[478,8,478,9],[459,0,459,1],[459,5,459,9],[461,1,461,2],[461,3,461,4],[461,6,461,7],[461,8,461,9]]}
["RINK",null,{"$f":"'CARDS 2'!$C$7","v":0},null,"SKIP",{"$f":"'CARDS 2'!$A$15","v":0}]
[2]
[null,{"$f":"'CARDS 2'!$A$15","v":0},null,{"$f":"'CARDS 2'!$N$15","v":0},null,null,{"$f":"'CARDS 2'!$A$15","v":0},null,{"$f":"'CARDS 2'!$N$15","v":0}]
["End","Shots","Total","Shots","Total","End","Shots","Total","Shots","Total"]
[1,null,null,null,null,14]
[2,null,null,null,null,15]
[3,null,null,null,null,16]
[4,null,null,null,null,17]
[5,null,null,null,null,18]
[6,null,null,null,null,19]
[7,null,null,null,null,20]
[8,null,null,null,null,21]
[9,null,null,null,null,22]
[10,null,null,null,null,23]
[11,null,null,null,null,24]
[12,null,null,null,null,25]
[13,null,null,null,null,"T"]
["RINK",null,{"$f":"'CARDS 2'!$C$30","v":0},null,"SKIP",{"$f":"'CARDS 2'!$A$38","v":0}]
[2]
[null,{"$f":"'CARDS 2'!$A$38","v":0},null,{"$f":"'CARDS 2'!$N$38","v":0},null,null,{"$f":"'CARDS 2'!$A$38","v":0},null,{"$f":"'CARDS 2'!$N$38","v":0}]
["End","Shots","Total","Shots","Total","End","Shots","Total","Shots","Total"]
[1,null,null,null,null,14]
[2,null,null,null,null,15]
[3,null,null,null,null,16]
[4,null,null,null,null,17]
[5,null,null,null,null,18]
[6,null,null,null,null,19]
[7,null,null,null,null,20]
[8,null,null,null,null,21]
[9,null,null,null,null,22]
[10,null,null,null,null,23]
[11,null,null,null,null,24]
[12,null,null,null,null,25]
[13,null,null,null,null,"T"]
["RINK",null,{"$f":"'CARDS 2'!$C$53","v":0},null,"SKIP",{"$f":"'CARDS 2'!$A$61","v":0}]
[2]
[null,{"$f":"'CARDS 2'!$A$61","v":0},null,{"$f":"'CARDS 2'!$N$61","v":0},null,null,{"$f":"'CARDS 2'!$A$61","v":0},null,{"$f":"'CARDS 2'!$N$61","v":0}]
["End","Shots","Total","Shots","Total","End","Shots","Total","Shots","Total"]
[1,null,null,null,null,14]
[2,null,null,null,null,15]
[3,null,null,null,null,16]
[4,null,null,null,null,17]
[5,null,null,null,null,18]
[6,null,null,null,null,19]
[7,null,null,null,null,20]
[8,null,null,null,null,21]
[9,null,null,null,null,22]
[10,null,null,null,null,23]
[11,null,null,null,null,24]
[12,null,null,null,null,25]
[13,null,null,null,null,"T"]
["RINK",null,{"$f":"'CARDS 2'!$C$76","v":0},null,"SKIP",{"$f":"'CARDS 2'!$A$84","v":0}]
[2]
[null,{"$f":"'CARDS 2'!$A$84","v":0},null,{"$f":"'CARDS 2'!$N$84","v":0},null,null,{"$f":"'CARDS 2'!$A$84","v":0},null,{"$f":"'CARDS 2'!$N$84","v":0}]
["End","Shots","Total","Shots","Total","End","Shots","Total","Shots","Total"]
[1,null,null,null,null,14]
[2,null,null,null,null,15]
[3,null,null,null,null,16]
[4,null,null,null,null,17]
[5,null,null,null,null,18]
[6,null,null,null,null,19]
[7,null,null,null,null,20]
[8,null,null,null,null,21]
[9,null,null,null,null,22]
[10,null,null,null,null,23]
[11,null,null,null,null,24]
[12,null,null,null,null,25]
[13,null,null,null,null,"T"]
["RINK",null,{"$f":"'CARDS 2'!$C$99","v":0},null,"SKIP",{"$f":"'CARDS 2'!$A$107","v":0}]
[2]
[null,{"$f":"'CARDS 2'!$A$107","v":0},null,{"$f":"'CARDS 2'!$N$107","v":0},null,null,{"$f":"'CARDS 2'!$A$107","v":0},null,{"$f":"'CARDS 2'!$N$107","v":0}]
["End","Shots","Total","Shots","Total","End","Shots","Total","Shots","Total"]
[1,null,null,null,null,14]
[2,null,null,null,null,15]
[3,null,null,null,null,16]
[4,null,null,null,null,17]
[5,null,null,null,null,18]
[6,null,null,null,null,19]
[7,null,null,null,null,20]
[8,null,null,null,null,21]
[9,null,null,null,null,22]
[10,null,null,null,null,23]
[11,null,null,null,null,24]
[12,null,null,null,null,25]
[13,null,null,null,null,"T"]
["RINK",null,{"$f":"'CARDS 2'!$C$122","v":0},null,"SKIP",{"$f":"'CARDS 2'!$A$130","v":0}]
[2]
[null,{"$f":"'CARDS 2'!$A$130","v":0},null,{"$f":"'CARDS 2'!$N$130","v":0},null,null,{"$f":"'CARDS 2'!$A$130","v":0},null,{"$f":"'CARDS 2'!$N$130","v":0}]
["End","Shots","Total","Shots","Total","End","Shots","Total","Shots","Total"]
[1,null,null,null,null,14]
[2,null,null,null,null,15]
[3,null,null,null,null,16]
[4,null,null,null,null,17]
[5,null,null,null,null,18]
[6,null,null,null,null,19]
[7,null,null,null,null,20]
[8,null,null,null,null,21]
[9,null,null,null,null,22]
[10,null,null,null,null,23]
[11,null,null,null,null,24]
[12,null,null,null,null,25]
[13,null,null,null,null,"T"]
["RINK",null,{"$f":"'CARDS 2'!$C$145","v":0},null,"SKIP",{"$f":"'CARDS 2'!$A$153","v":0}]
[2]
[null,{"$f":"'CARDS 2'!$A$153","v":0},null,{"$f":"'CARDS 2'!$N$153","v":0},null,null,{"$f":"'CARDS 2'!$A$153","v":0},null,{"$f":"'CARDS 2'!$N$153","v":0}]
["End","Shots","Total","Shots","Total","End","Shots","Total","Shots","Total"]
[1,null,null,null,null,14]
[2,null,null,null,null,15]
[3,null,null,null,null,16]
[4,null,null,null,null,17]
[5,null,null,null,null,18]
[6,null,null,null,null,19]
[7,null,null,null,null,20]
[8,null,null,null,null,21]
[9,null,null,null,null,22]
[10,null,null,null,null,23]
[11,null,null,null,null,24]
[12,null,null,null,null,25]
[13,null,null,null,null,"T"]
["RINK",null,{"$f":"'CARDS 2'!$C$168","v":0},null,"SKIP",{"$f":"'CARDS 2'!$A$176","v":0}]
[2]
[null,{"$f":"'CARDS 2'!$A$176","v":0},null,{"$f":"'CARDS 2'!$N$176","v":0},null,null,{"$f":"'CARDS 2'!$A$176","v":0},null,{"$f":"'CARDS 2'!$N$176","v":0}]
["End","Shots","Total","Shots","Total","End","Shots","Total","Shots","Total"]
[1,null,null,null,null,14]
[2,null,null,null,null,15]
[3,null,null,null,null,16]
[4,null,null,null,null,17]
[5,null,null,null,null,18]
[6,null,null,null,null,19]
[7,null,null,null,null,20]
[8,null,null,null,null,21]
[9,null,null,null,null,22]
[10,null,null,null,null,23]
[11,null,null,null,null,24]
[12,null,null,null,null,25]
[13,null,null,null,null,"T"]
["RINK",null,{"$f":"'CARDS 2'!$C$191","v":0},null,"SKIP",{"$f":"'CARDS 2'!$A$199","v":0}]
[2]
[null,{"$f":"'CARDS 2'!$A$199","v":0},null,{"$f":"'CARDS 2'!$N$199","v":0},null,null,{"$f":"'CARDS 2'!$A$199","v":0},null,{"$f":"'CARDS 2'!$N$199","v":0}]
["End","Shots","Total","Shots","Total","End","Shots","Total","Shots","Total"]
[1,null,null,null,null,14]
[2,null,null,null,null,15]
[3,null,null,null,null,16]
[4,null,null,null,null,17]
[5,null,null,null,null,18]
[6,null,null,null,null,19]
[7,null,null,null,null,20]
[8,null,null,null,null,21]
[9,null,null,null,null,22]
[10,null,null,null,null,23]
[11,null,null,null,null,24]
[12,null,null,null,null,25]
[13,null,null,null,null,"T"]
["RINK",null,{"$f":"'CARDS 2'!$C$214","v":0},null,"SKIP",{"$f":"'CARDS 2'!$A$222","v":0}]
[2]
[null,{"$f":"'CARDS 2'!$A$222","v":0},null,{"$f":"'CARDS 2'!$N$222","v":0},null,null,{"$f":"'CARDS 2'!$A$222","v":0},null,{"$f":"'CARDS 2'!$N$222","v":0}]
["End","Shots","Total","Shots","Total","End","Shots","Total","Shots","Total"]
[1,null,null,null,null,14]
[2,null,null,null,null,15]
[3,null,null,null,null,16]
[4,null,null,null,null,17]
[5,null,null,null,null,18]
[6,null,null,null,null,19]
[7,null,null,null,null,20]
[8,null,null,null,null,21]
[9,null,null,null,null,22]
[10,null,null,null,null,23]
[11,null,null,null,null,24]
[12,null,null,null,null,25]
[13,null,null,null,null,"T"]
["RINK",null,{"$f":"'CARDS 2'!$C$237","v":0},null,"SKIP",{"$f":"'CARDS 2'!$A$245","v":0}]
[2]
[null,{"$f":"'CARDS 2'!$A$245","v":0},null,{"$f":"'CARDS 2'!$N$245","v":0},null,null,{"$f":"'CARDS 2'!$A$245","v":0},null,{"$f":"'CARDS 2'!$N$245","v":0}]
["End","Shots","Total","Shots","Total","End","Shots","Total","Shots","Total"]
[1,null,null,null,null,14]
[2,null,null,null,null,15]
[3,null,null,null,null,16]
[4,null,null,null,null,17]
[5,null,null,null,null,18]
[6,null,null,null,null,19]
[7,null,null,null,null,20]
[8,null,null,null,null,21]
[9,null,null,null,null,22]
[10,null,null,null,null,23]
[11,null,null,null,null,24]
[12,null,null,null,null,25]
[13,null,null,null,null,"T"]
["RINK",null,{"$f":"'CARDS 2'!$C$260","v":0},null,"SKIP",{"$f":"'CARDS 2'!$A$268","v":0}]
[2]
[null,{"$f":"'CARDS 2'!$A$268","v":0},null,{"$f":"'CARDS 2'!$N$268","v":0},null,null,{"$f":"'CARDS 2'!$A$268","v":0},null,{"$f":"'CARDS 2'!$N$268","v":0}]
["End","Shots","Total","Shots","Total","End","Shots","Total","Shots","Total"]
[1,null,null,null,null,14]
[2,null,null,null,null,15]
[3,null,null,null,null,16]
[4,null,null,null,null,17]
[5,null,null,null,null,18]
[6,null,null,null,null,19]
[7,null,null,null,null,20]
[8,null,null,null,null,21]
[9,null,null,null,null,22]
[10,null,null,null,null,23]
[11,null,null,null,null,24]
[12,null,null,null,null,25]
[13,null,null,null,null,"T"]
["RINK",null,{"$f":"'CARDS 2'!$C$283","v":0},null,"SKIP",{"$f":"'CARDS 2'!$A$291","v":0}]
[2]
[null,{"$f":"'CARDS 2'!$A$291","v":0},null,{"$f":"'CARDS 2'!$N$291","v":0},null,null,{"$f":"'CARDS 2'!$A$291","v":0},null,{"$f":"'CARDS 2'!$N$291","v":0}]
["End","Shots","Total","Shots","Total","End","Shots","Total","Shots","Total"]
[1,null,null,null,null,14]
[2,null,null,null,null,15]
[3,null,null,null,null,16]
[4,null,null,null,null,17]
[5,null,null,null,null,18]
[6,null,null,null,null,19]
[7,null,null,null,null,20]
[8,null,null,null,null,21]
[9,null,null,null,null,22]
[10,null,null,null,null,23]
[11,null,null,null,null,24]
[12,null,null,null,null,25]
[13,null,null,null,null,"T"]
["RINK",null,{"$f":"'CARDS 2'!$C$306","v":0},null,"SKIP",{"$f":"'CARDS 2'!$A$314","v":0}]
[2]
[null,{"$f":"'CARDS 2'!$A$314","v":0},null,{"$f":"'CARDS 2'!$N$314","v":0},null,null,{"$f":"'CARDS 2'!$A$314","v":0},null,{"$f":"'CARDS 2'!$N$314","v":0}]
["End","Shots","Total","Shots","Total","End","Shots","Total","Shots","Total"]
[1,null,null,null,null,14]
[2,null,null,null,null,15]
[3,null,null,null,null,16]
[4,null,null,null,null,17]
[5,null,null,null,null,18]
[6,null,null,null,null,19]
[7,null,null,null,null,20]
[8,null,null,null,null,21]
[9,null,null,null,null,22]
[10,null,null,null,null,23]
[11,null,null,null,null,24]
[12,null,null,null,null,25]
[13,null,null,null,null,"T"]
["RINK",null,{"$f":"'CARDS 2'!$C$329","v":0},null,"SKIP",{"$f":"'CARDS 2'!$A$337","v":0}]
[2]
[null,{"$f":"'CARDS 2'!$A$337","v":0},null,{"$f":"'CARDS 2'!$N$337","v":0},null,null,{"$f":"'CARDS 2'!$A$337","v":0},null,{"$f":"'CARDS 2'!$N$337","v":0}]
["End","Shots","Total","Shots","Total","End","Shots","Total","Shots","Total"]
[1,null,null,null,null,14]
[2,null,null,null,null,15]
[3,null,null,null,null,16]
[4,null,null,null,null,17]
[5,null,null,null,null,18]
[6,null,null,null,null,19]
[7,null,null,null,null,20]
[8,null,null,null,null,21]
[9,null,null,null,null,22]
[10,null,null,null,null,23]
[11,null,null,null,null,24]
[12,null,null,null,null,25]
[13,null,null,null,null,"T"]
["RINK",null,{"$f":"'CARDS 2'!$C$352","v":0},null,"SKIP",{"$f":"'CARDS 2'!$A$360","v":0}]
[2]
[null,{"$f":"'CARDS 2'!$A$360","v":0},null,{"$f":"'CARDS 2'!$N$360","v":0},null,null,{"$f":"'CARDS 2'!$A$360","v":0},null,{"$f":"'CARDS 2'!$N$360","v":0}]
["End","Shots","Total","Shots","Total","End","Shots","Total","Shots","Total"]
[1,null,null,null,null,14]
[2,null,null,null,null,15]
[3,null,null,null,null,16]
[4,null,null,null,null,17]
[5,null,null,null,null,18]
[6,null,null,null,null,19]
[7,null,null,null,null,20]
[8,null,null,null,null,21]
[9,null,null,null,null,22]
[10,null,null,null,null,23]
[11,null,null,null,null,24]
[12,null,null,null,null,25]
[13,null,null,null,null,"T"]
["RINK",null,{"$f":"'CARDS 2'!$C$375","v":0},null,"SKIP",{"$f":"'CARDS 2'!$A$383","v":0}]
[2]
[null,{"$f":"'CARDS 2'!$A$383","v":0},null,{"$f":"'CARDS 2'!$N$383","v":0},null,null,{"$f":"'CARDS 2'!$A$383","v":0},null,{"$f":"'CARDS 2'!$N$383","v":0}]
["End","Shots","Total","Shots","Total","End","Shots","Total","Shots","Total"]
[1,null,null,null,null,14]
[2,null,null,null,null,15]
[3,null,null,null,null,16]
[4,null,null,null,null,17]
[5,null,null,null,null,18]
[6,null,null,null,null,19]
[7,null,null,null,null,20]
[8,null,null,null,null,21]
[9,null,null,null,null,22]
[10,null,null,null,null,23]
[11,null,null,null,null,24]
[12,null,null,null,null,25]
[13,null,null,null,null,"T"]
["RINK",null,{"$f":"'CARDS 2'!$C$398","v":0},null,"SKIP",{"$f":"'CARDS 2'!$A$406","v":0}]
[2]
[null,{"$f":"'CARDS 2'!$A$406","v":0},null,{"$f":"'CARDS 2'!$N$406","v":0},null,null,{"$f":"'CARDS 2'!$A$406","v":0},null,{"$f":"'CARDS 2'!$N$406","v":0}]
["End","Shots","Total","Shots","Total","End","Shots","Total","Shots","Total"]
[1,null,null,null,null,14]
[2,null,null,null,null,15]
[3,null,null,null,null,16]
[4,null,null,null,null,17]
[5,null,null,null,null,18]
[6,null,null,null,null,19]
[7,null,null,null,null,20]
[8,null,null,null,null,21]
[9,null,null,null,null,22]
[10,null,null,null,null,23]
[11,null,null,null,null,24]
[12,null,null,null,null,25]
[13,null,null,null,null,"T"]
["RINK",null,{"$f":"'CARDS 2'!$C$421","v":0},null,"SKIP",{"$f":"'CARDS 2'!$A$429","v":0}]
[2]
[null,{"$f":"'CARDS 2'!$A$429","v":0},null,{"$f":"'CARDS 2'!$N$429","v":0},null,null,{"$f":"'CARDS 2'!$A$429","v":0},null,{"$f":"'CARDS 2'!$N$429","v":0}]
["End","Shots","Total","Shots","Total","End","Shots","Total","Shots","Total"]
[1,null,null,null,null,14]
[2,null,null,null,null,15]
[3,null,null,null,null,16]
[4,null,null,null,null,17]
[5,null,null,null,null,18]
[6,null,null,null,null,19]
[7,null,null,null,null,20]
[8,null,null,null,null,21]
[9,null,null,null,null,22]
[10,null,null,null,null,23]
[11,null,null,null,null,24]
[12,null,null,null,null,25]
[13,null,null,null,null,"T"]
["RINK",null,{"$f":"'CARDS 2'!$C$444","v":0},null,"SKIP",{"$f":"'CARDS 2'!$A$452","v":0}]
[2]
[null,{"$f":"'CARDS 2'!$A$452","v":0},null,{"$f":"'CARDS 2'!$N$452","v":0},null,null,{"$f":"'CARDS 2'!$A$452","v":0},null,{"$f":"'CARDS 2'!$N$452","v":0}]
["End","Shots","Total","Shots","Total","End","Shots","Total","Shots","Total"]
[1,null,null,null,null,14]
[2,null,null,null,null,15]
[3,null,null,null,null,16]
[4,null,null,null,null,17]
[5,null,null,null,null,18]
[6,null,null,null,null,19]
[7,null,null,null,null,20]
[8,null,null,null,null,21]
[9,null,null,null,null,22]
[10,null,null,null,null,23]
[11,null,null,null,null,24]
[12,null,null,null,null,25]
[13,null,null,null,null,"T"]
["RINK",null,{"$f":"'CARDS 2'!$C$467","v":0},null,"SKIP",{"$f":"'CARDS 2'!$A$475","v":0}]
[2]
[null,{"$f":"'CARDS 2'!$A$475","v":0},null,{"$f":"'CARDS 2'!$N$475","v":0},null,null,{"$f":"'CARDS 2'!$A$475","v":0},null,{"$f":"'CARDS 2'!$N$475","v":0}]
["End","Shots","Total","Shots","Total","End","Shots","Total","Shots","Total"]
[1,null,null,null,null,14]
[2,null,null,null,null,15]
[3,null,null,null,null,16]
[4,null,null,null,null,17]
[5,null,null,null,null,18]
[6,null,null,null,null,19]
[7,null,null,null,null,20]
[8,null,null,null,null,21]
[9,null,null,null,null,22]
[10,null,null,null,null,23]
[11,null,null,null,null,24]
[12,null,null,null,null,25]
[13,null,null,null,null,"T"]
["RINK",null,{"$f":"'CARDS 2'!$C$490","v":0},null,"SKIP",{"$f":"'CARDS 2'!$A$498","v":0}]
[2]
[null,{"$f":"'CARDS 2'!$A$498","v":0},null,{"$f":"'CARDS 2'!$N$498","v":0},null,null,{"$f":"'CARDS 2'!$A$498","v":0},null,{"$f":"'CARDS 2'!$N$498","v":0}]
["End","Shots","Total","Shots","Total","End","Shots","Total","Shots","Total"]
[1,null,null,null,null,14]
[2,null,null,null,null,15]
[3,null,null,null,null,16]
[4,null,null,null,null,17]
[5,null,null,null,null,18]
[6,null,null,null,null,19]
[7,null,null,null,null,20]
[8,null,null,null,null,21]
[9,null,null,null,null,22]
[10,null,null,null,null,23]
[11,null,null,null,null,24]
[12,null,null,null,null,25]
[13,null,null,null,null,"T"]
["RINK",null,{"$f":"'CARDS 2'!$C$513","v":0},null,"SKIP",{"$f":"'CARDS 2'!$A$521","v":0}]
[2]
[null,{"$f":"'CARDS 2'!$A$521","v":0},null,{"$f":"'CARDS 2'!$N$521","v":0},null,null,{"$f":"'CARDS 2'!$A$521","v":0},null,{"$f":"'CARDS 2'!$N$521","v":0}]
["End","Shots","Total","Shots","Total","End","Shots","Total","Shots","Total"]
[1,null,null,null,null,14]
[2,null,null,null,null,15]
[3,null,null,null,null,16]
[4,null,null,null,null,17]
[5,null,null,null,null,18]
[6,null,null,null,null,19]
[7,null,null,null,null,20]
[8,null,null,null,null,21]
[9,null,null,null,null,22]
[10,null,null,null,null,23]
[11,null,null,null,null,24]
[12,null,null,null,null,25]
[13,null,null,null,null,"T"]
["RINK",null,{"$f":"'CARDS 2'!$C$536","v":0},null,"SKIP",{"$f":"'CARDS 2'!$A$544","v":0}]
[2]
[null,{"$f":"'CARDS 2'!$A$544","v":0},null,{"$f":"'CARDS 2'!$N$544","v":0},null,null,{"$f":"'CARDS 2'!$A$544","v":0},null,{"$f":"'CARDS 2'!$N$544","v":0}]
["End","Shots","Total","Shots","Total","End","Shots","Total","Shots","Total"]
[1,null,null,null,null,14]
[2,null,null,null,null,15]
[3,null,null,null,null,16]
[4,null,null,null,null,17]
[5,null,null,null,null,18]
[6,null,null,null,null,19]
[7,null,null,null,null,20]
[8,null,null,null,null,21]
[9,null,null,null,null,22]
[10,null,null,null,null,23]
[11,null,null,null,null,24]
[12,null,null,null,null,25]
[13,null,null,null,null,"T"]
["RINK",null,{"$f":"'CARDS 2'!$C$559","v":0},null,"SKIP",{"$f":"'CARDS 2'!$A$567","v":0}]
[2]
[null,{"$f":"'CARDS 2'!$A$567","v":0},null,{"$f":"'CARDS 2'!$N$567","v":0},null,null,{"$f":"'CARDS 2'!$A$567","v":0},null,{"$f":"'CARDS 2'!$N$567","v":0}]
["End","Shots","Total","Shots","Total","End","Shots","Total","Shots","Total"]
[1,null,null,null,null,14]
[2,null,null,null,null,15]
[3,null,null,null,null,16]
[4,null,null,null,null,17]
[5,null,null,null,null,18]
[6,null,null,null,null,19]
[7,null,null,null,null,20]
[8,null,null,null,null,21]
[9,null,null,null,null,22]
[10,null,null,null,null,23]
[11,null,null,null,null,24]
[12,null,null,null,null,25]
[13,null,null,null,null,"T"]
["RINK",null,{"$f":"'CARDS 2'!$C$582","v":0},null,"SKIP",{"$f":"'CARDS 2'!$A$590","v":0}]
[2]
[null,{"$f":"'CARDS 2'!$A$590","v":0},null,{"$f":"'CARDS 2'!$N$590","v":0},null,null,{"$f":"'CARDS 2'!$A$590","v":0},null,{"$f":"'CARDS 2'!$N$590","v":0}]
["End","Shots","Total","Shots","Total","End","Shots","Total","Shots","Total"]
[1,null,null,null,null,14]
[2,null,null,null,null,15]
[3,null,null,null,null,16]
[4,null,null,null,null,17]
[5,null,null,null,null,18]
[6,null,null,null,null,19]
[7,null,null,null,null,20]
[8,null,null,null,null,21]
[9,null,null,null,null,22]
[10,null,null,null,null,23]
[11,null,null,null,null,24]
[12,null,null,null,null,25]
[13,null,null,null,null,"T"]
["RINK",null,{"$f":"'CARDS 2'!$C$605","v":0},null,"SKIP",{"$f":"'CARDS 2'!$A$613","v":0}]
[2]
[null,{"$f":"'CARDS 2'!$A$613","v":0},null,{"$f":"'CARDS 2'!$N$613","v":0},null,null,{"$f":"'CARDS 2'!$A$613","v":0},null,{"$f":"'CARDS 2'!$N$613","v":0}]
["End","Shots","Total","Shots","Total","End","Shots","Total","Shots","Total"]
[1,null,null,null,null,14]
[2,null,null,null,null,15]
[3,null,null,null,null,16]
[4,null,null,null,null,17]
[5,null,null,null,null,18]
[6,null,null,null,null,19]
[7,null,null,null,null,20]
[8,null,null,null,null,21]
[9,null,null,null,null,22]
[10,null,null,null,null,23]
[11,null,null,null,null,24]
[12,null,null,null,null,25]
[13,null,null,null,null,"T"]
["RINK",null,{"$f":"'CARDS 2'!$C$628","v":0},null,"SKIP",{"$f":"'CARDS 2'!$A$636","v":0}]
[2]
[null,{"$f":"'CARDS 2'!$A$636","v":0},null,{"$f":"'CARDS 2'!$N$636","v":0},null,null,{"$f":"'CARDS 2'!$A$636","v":0},null,{"$f":"'CARDS 2'!$N$636","v":0}]
["End","Shots","Total","Shots","Total","End","Shots","Total","Shots","Total"]
[1,null,null,null,null,14]
[2,null,null,null,null,15]
[3,null,null,null,null,16]
[4,null,null,null,null,17]
[5,null,null,null,null,18]
[6,null,null,null,null,19]
[7,null,null,null,null,20]
[8,null,null,null,null,21]
[9,null,null,null,null,22]
[10,null,null,null,null,23]
[11,null,null,null,null,24]
[12,null,null,null,null,25]
[13,null,null,null,null,"T"]
["RINK",null,null,null,"SKIP"]
[2]
[]
["End","Shots","Total","Shots","Total","End","Shots","Total","Shots","Total"]
[1,null,null,null,null,14]
[2,null,null,null,null,15]
[3,null,null,null,null,16]
[4,null,null,null,null,17]
[5,null,null,null,null,18]
[6,null,null,null,null,19]
[7,null,null,null,null,20]
[8,null,null,null,null,21]
[9,null,null,null,null,22]
[10,null,null,null,null,23]
[11,null,null,null,null,24]
[12,null,null,null,null,25]
[13,null,null,null,null,"T"]